N-Acetyl-L-glutamic acid
- Formula: C7H11NO5
- Molecular weight: 189.1659
- IUPAC Standard InChIKey: RFMMMVDNIPUKGG-RXMQYKEDSA-N
- CAS Registry Number: 1188-37-0
- Chemical structure:
View 3d structure (requires JavaScript / HTML 5) - Other names: Acetyl-L-glutamic acid; L-Glutamic acid, N-acetyl-; N-acetylglutamic acid

Reaction thermochemistry data

Data compiled by: Robert C. Dunbar
Individual Reactions
By formula: Na+ + C7H11NO5 = (Na+ • C7H11NO5)
Free energy of reaction
ΔrG° (kJ/mol) | T (K) | Method | Reference |
---|---|---|---|
155. | 0. | CIDC | Feng, Gronert, et al., 1999 |

Ion clustering data

Data compiled by: Robert C. Dunbar
Clustering reactions
By formula: Na+ + C7H11NO5 = (Na+ • C7H11NO5)
Free energy of reaction
ΔrG° (kJ/mol) | T (K) | Method | Reference |
---|---|---|---|
155. | 0. | CIDC | Feng, Gronert, et al., 1999 |

References

Feng, Gronert, et al., 1999
Feng, W.Y.; Gronert, S.; Lebrilla, C.B.,
Lithium and sodium ion binding energies of N-acetyl and N-glycyl amino acids,
J. Am. Chem. Soc., 1999, 121, 6, 1365, https://doi.org/10.1021/ja983116s
. [all data]