N-Acetyl-L-leucine
- Formula: C8H15NO3
- Molecular weight: 173.2096
- IUPAC Standard InChIKey: WXNXCEHXYPACJF-SSDOTTSWSA-N
- CAS Registry Number: 1188-21-2
- Chemical structure:
View 3d structure (requires JavaScript / HTML 5) - Other names: L-Leucine, N-acetyl-; Acetyl-L-leucine; Leucine, N-acetyl-, L-; N-Acetylleucine

Reaction thermochemistry data

Data compiled by: Robert C. Dunbar
Individual Reactions
By formula: Na+ + C8H15NO3 = (Na+ • C8H15NO3)
Free energy of reaction
ΔrG° (kJ/mol) | T (K) | Method | Reference |
---|---|---|---|
142. | 0. | CIDC | Feng, Gronert, et al., 1999 |

Ion clustering data

Data compiled by: Robert C. Dunbar
Clustering reactions
By formula: Na+ + C8H15NO3 = (Na+ • C8H15NO3)
Free energy of reaction
ΔrG° (kJ/mol) | T (K) | Method | Reference |
---|---|---|---|
142. | 0. | CIDC | Feng, Gronert, et al., 1999 |

References

Feng, Gronert, et al., 1999
Feng, W.Y.; Gronert, S.; Lebrilla, C.B.,
Lithium and sodium ion binding energies of N-acetyl and N-glycyl amino acids,
J. Am. Chem. Soc., 1999, 121, 6, 1365, https://doi.org/10.1021/ja983116s
. [all data]