Phenol, 4,4'-methylenebis[2,6-bis(1,1-dimethylethyl)-
- Formula: C29H44O2
- Molecular weight: 424.6585
- IUPAC Standard InChIKey: MDWVSAYEQPLWMX-UHFFFAOYSA-N
- CAS Registry Number: 118-82-1
- Chemical structure:
View 3d structure (requires JavaScript / HTML 5) - Other names: Phenol, 4,4'-methylenebis[2,6-di-tert-butyl-; Antioxidant E 702; Bimox M; Binox M; E 702; Ethyl 702; Etil 702; Ionox 220; Ionox 220 Antioxidant; LZ-MB 1; MB 1 (Antioxidant); 4,4'-Methylenebis[2,6-Di-tert-butylphenol]; 4,4'-Dihydroxy,3,3'-5,5'-tetra-t-butyldiphenylmethane; 4,4'-Methylenebis(2,6-di-t-butylphenol); 4,4'-Dihydroxy-3,5,3',5'-tetra-tert-butyldiphenylmethane; Di(4-hydroxy-3,5-di-tert-butylphenyl)methane; L 3MB1; 2,2',6,6'-Tetra-tert-butyl-4,4'-methylenediphenol; NSC 30551

Phase change data

Data compiled as indicated in comments:
BS - Robert L. Brown and Stephen E. Stein
TRC - Thermodynamics Research Center, NIST Boulder Laboratories, Chris Muzny director
AC - William E. Acree, Jr., James S. Chickos
Quantity | Value | Units | Method | Reference | Comment |
---|---|---|---|---|---|
Tfus | 447.7 | K | N/A | Inozemtsev, Liakumovich, et al., 1972 | Uncertainty assigned by TRC = 0.5 K; TRC |
Reduced pressure boiling point
Tboil (K) | Pressure (bar) | Reference | Comment |
---|---|---|---|
562.2 | 0.053 | Weast and Grasselli, 1989 | BS |
Enthalpy of fusion
ΔfusH (kJ/mol) | Temperature (K) | Method | Reference | Comment |
---|---|---|---|---|
42.97 | 447.7 | DTA | Inozemtsev, Liakumovich, et al., 1972 | AC |

References

Inozemtsev, Liakumovich, et al., 1972
Inozemtsev, P.P.; Liakumovich, A.G.; Gracheva, Z.D.,
Russ. J. Phys. Chem., 1972, 46, 6, 914. [all data]
Weast and Grasselli, 1989
CRC Handbook of Data on Organic Compounds, 2nd Editon, Weast,R.C and Grasselli, J.G., ed(s)., CRC Press, Inc., Boca Raton, FL, 1989, 1. [all data]
Fihtengolts, et al., 1969
Fihtengolts, V.S., et al.,
Atlas of UV Absorption Spectra of Substances Used in Synthetic Rubber Manufacture, 1969, 101. [all data]