N-dl-Alanylglycine
- Formula: C5H10N2O3
- Molecular weight: 146.1445
- IUPAC Standard InChIKey: CXISPYVYMQWFLE-UHFFFAOYSA-N
- CAS Registry Number: 1188-01-8
- Chemical structure:
View 3d structure (requires JavaScript / HTML 5) - Stereoisomers:
- Other names: Glycine, N-DL-alanyl-

Condensed phase thermochemistry data

Data compiled as indicated in comments:
ALS - Hussein Y. Afeefy, Joel F. Liebman, and Stephen E. Stein
DH - Eugene S. Domalski and Elizabeth D. Hearing
Quantity | Value | Units | Method | Reference | Comment |
---|---|---|---|---|---|
ΔfH°solid | -777.39 ± 0.88 | kJ/mol | Ccb | Huffman, 1942 | ALS |
Quantity | Value | Units | Method | Reference | Comment |
ΔcH°solid | -2618.9 ± 0.84 | kJ/mol | Ccb | Huffman, 1942 | ALS |
Quantity | Value | Units | Method | Reference | Comment |
S°solid,1 bar | 213.4 | J/mol*K | N/A | Huffman, 1941 | Extrapolation below 90 K, 66.27 J/mol*K.; DH |
Constant pressure heat capacity of solid
Cp,solid (J/mol*K) | Temperature (K) | Reference | Comment |
---|---|---|---|
181.79 | 296.4 | Huffman, 1941 | T = 85 to 296 K. Value is unsmoothed experimental datum.; DH |

Reaction thermochemistry data

Data compiled by: Robert C. Dunbar
Individual Reactions
By formula: Na+ + C5H10N2O3 = (Na+ • C5H10N2O3)
Quantity | Value | Units | Method | Reference | Comment |
---|---|---|---|---|---|
ΔrH° | 178. ± 7.1 | kJ/mol | CIDC | Cerda, Hoyau, et al., 1998 |

Ion clustering data

Data compiled by: Robert C. Dunbar
Clustering reactions
By formula: Na+ + C5H10N2O3 = (Na+ • C5H10N2O3)
Quantity | Value | Units | Method | Reference | Comment |
---|---|---|---|---|---|
ΔrH° | 178. ± 7.1 | kJ/mol | CIDC | Cerda, Hoyau, et al., 1998 |

References

Huffman, 1942
Huffman, H.M.,
Thermal data. XV. The heats of combustion and free energies of some compounds containing the peptide bond,
J. Phys. Chem., 1942, 46, 885-891. [all data]
Huffman, 1941
Huffman, H.M.,
Thermal data. XIV. The heat capacities and entropies of some compounds having the peptide bond,
J. Am. Chem. Soc., 1941, 63, 688-689. [all data]
Cerda, Hoyau, et al., 1998
Cerda, B.A.; Hoyau, S.; Ohanessian, G.; Wesdemiotis, C.,
PAs of Peptides,
J. Am. Chem. Soc., 1998, 120, 2437. [all data]