Phenol, 2,4,6-tribromo-
- Formula: C6H3Br3O
- Molecular weight: 330.799
- IUPAC Standard InChIKey: BSWWXRFVMJHFBN-UHFFFAOYSA-N
- CAS Registry Number: 118-79-6
- Chemical structure:
View 3d structure (requires JavaScript / HTML 5) - Other names: Bromkal Pur 3; Bromol; Flammex 3BP; 2,4,6-Tribromophenol; TA 10; Emery 9332; FR-613; Great Lakes PH-73; 1,3,5-Tribromo-2-hydroxybenzene; NSC 2136; TBP; PH 73

Gas phase thermochemistry data

Data compiled by: Hussein Y. Afeefy, Joel F. Liebman, and Stephen E. Stein
Quantity | Value | Units | Method | Reference | Comment |
---|---|---|---|---|---|
ΔfH°gas | -0.9 ± 2.5 | kJ/mol | Ccr | Allot and Finch, 1987 | The mean of Heat of formations recomended by author |

Condensed phase thermochemistry data

Data compiled as indicated in comments:
ALS - Hussein Y. Afeefy, Joel F. Liebman, and Stephen E. Stein
DH - Eugene S. Domalski and Elizabeth D. Hearing
Quantity | Value | Units | Method | Reference | Comment |
---|---|---|---|---|---|
ΔfH°solid | -101. ± 4. | kJ/mol | Cm | Allott and Finch, 1989 | Bromination of phenol; ALS |
ΔfH°solid | -98.5 ± 2.3 | kJ/mol | Ccr | Allot and Finch, 1987 | The mean of Heat of formations recomended by author; ALS |
Quantity | Value | Units | Method | Reference | Comment |
ΔcH°solid | -2689.2 ± 3.5 | kJ/mol | Ccr | Allot and Finch, 1987 | The mean of Heat of formations recomended by author; ALS |
Constant pressure heat capacity of solid
Cp,solid (J/mol*K) | Temperature (K) | Reference | Comment |
---|---|---|---|
172.0 | 298.15 | Allot and Finch, 1987 | Cp given as 0.52 J/g*K.; DH |

Phase change data

Data compiled as indicated in comments:
BS - Robert L. Brown and Stephen E. Stein
TRC - Thermodynamics Research Center, NIST Boulder Laboratories, Chris Muzny director
ALS - Hussein Y. Afeefy, Joel F. Liebman, and Stephen E. Stein
AC - William E. Acree, Jr., James S. Chickos
Quantity | Value | Units | Method | Reference | Comment |
---|---|---|---|---|---|
Tfus | 368.65 | K | N/A | Beringer, Brierley, et al., 1953 | Uncertainty assigned by TRC = 2. K; TRC |
Tfus | 368. | K | N/A | Timmermans, 1935 | Uncertainty assigned by TRC = 1.5 K; TRC |
Tfus | 366. | K | N/A | Robertson, 1902 | Uncertainty assigned by TRC = 3. K; TRC |
Quantity | Value | Units | Method | Reference | Comment |
ΔsubH° | 97.6 ± 1.1 | kJ/mol | C | Allot and Finch, 1987 | The mean of Heat of formations recomended by author; ALS |
Reduced pressure boiling point
Tboil (K) | Pressure (bar) | Reference | Comment |
---|---|---|---|
559.2 | 0.995 | Aldrich Chemical Company Inc., 1990 | BS |
Enthalpy of fusion
ΔfusH (kJ/mol) | Temperature (K) | Reference | Comment |
---|---|---|---|
20.9 | 367.5 | Kuramochi, Maeda, et al., 2004 | AC |
18.52 | 366.2 | Acree, 1991 | AC |

Van Den Dool and Kratz RI, non-polar column, custom temperature program

Column type | Active phase | I | Reference | Comment |
---|---|---|---|---|
Capillary | 5 % Phenyl methyl siloxane | 1624. | Yasuhara, Shiraishi, et al., 1997 | 25. m/0.31 mm/0.52 μm, He; Program: 50C(2min) => (20C/min) => 120C => (7C/min) => 310C(10min) |

Normal alkane RI, non-polar column, temperature ramp

Column type | Active phase | I | Reference | Comment |
---|---|---|---|---|
Capillary | Ultra-1 | 1576. | Okumura, 1991 | 25. m/0.32 mm/0.25 μm, He, 3. K/min; Tstart: 80. C; Tend: 260. C |

Lee's RI, non-polar column, temperature ramp

Column type | Active phase | I | Reference | Comment |
---|---|---|---|---|
Capillary | DB-5 | 278.5 | Donnelly, Abdel-Hamid, et al., 1993 | 30. m/0.32 mm/0.25 μm, He, 40. C @ 3. min, 8. K/min, 285. C @ 29.5 min |

References

Allot and Finch, 1987
Allot, P.H.; Finch, A.,
Enthalpies of formation of 2,4,6-tribromophenol and of 2,4,6-tribromoaniline,
J. Chem. Thermodyn., 1987, 19, 771-779. [all data]
Allott and Finch, 1989
Allott, P.H.; Finch, A.,
The sequential bromination of phenols,
Thermochim. Acta, 1989, 146, 371-374. [all data]
Beringer, Brierley, et al., 1953
Beringer, F.M.; Brierley, A.; Drexler, M.; Gindler, E.M.; Lumpkin, C.C.,
Diaryliodonium Salts II. The Phenylation of Organic and Inorganic Bases,
J. Am. Chem. Soc., 1953, 75, 2708. [all data]
Timmermans, 1935
Timmermans, J.,
Researches in Stoichiometry. I. The Heat of Fusion of Organic Compounds.,
Bull. Soc. Chim. Belg., 1935, 44, 17-40. [all data]
Robertson, 1902
Robertson, P.W.,
Atomic and molecular heats of fusion.,
J. Chem. Soc., 1902, 81, 1233. [all data]
Aldrich Chemical Company Inc., 1990
Aldrich Chemical Company Inc.,
Catalog Handbook of Fine Chemicals, Aldrich Chemical Company, Inc., Milwaukee WI, 1990, 1. [all data]
Kuramochi, Maeda, et al., 2004
Kuramochi, Hidetoshi; Maeda, Kouji; Kawamoto, Katsuya,
WATER SOLUBILITY AND PARTITIONING BEHAVIOR OF BROMINATED PHENOLS,
Environ Toxicol Chem, 2004, 23, 6, 1386, https://doi.org/10.1897/03-279
. [all data]
Acree, 1991
Acree, William E.,
Thermodynamic properties of organic compounds: enthalpy of fusion and melting point temperature compilation,
Thermochimica Acta, 1991, 189, 1, 37-56, https://doi.org/10.1016/0040-6031(91)87098-H
. [all data]
Yasuhara, Shiraishi, et al., 1997
Yasuhara, A.; Shiraishi, H.; Nishikawa, M.; Yamamoto, T.; Uehiro, T.; Nakasugi, O.; Okumura, T.; Kenmotsu, K.; Fukui, H.; Nagase, M.; Ono, Y.; Kawagoshi, Y.; Baba, K.; Noma, Y.,
Determination of organic components in leachates from hazardous waste disposal sites in Japan by gas chromatography-mass spectrometry,
J. Chromatogr. A, 1997, 774, 1-2, 321-332, https://doi.org/10.1016/S0021-9673(97)00078-2
. [all data]
Okumura, 1991
Okumura, T.,
retention indices of environmental chemicals on methyl silicone capillary column,
Journal of Environmental Chemistry (Japan), 1991, 1, 2, 333-358, https://doi.org/10.5985/jec.1.333
. [all data]
Donnelly, Abdel-Hamid, et al., 1993
Donnelly, J.R.; Abdel-Hamid, M.S.; Jeter, J.L.; Gurka, D.F.,
Application of gas chromatographic retention properties to the identification of environmental contaminants,
J. Chromatogr., 1993, 642, 1-2, 409-415, https://doi.org/10.1016/0021-9673(93)80106-I
. [all data]