Propanamide, N-methyl-
- Formula: C4H9NO
- Molecular weight: 87.1204
- IUPAC Standard InChIKey: QJQAMHYHNCADNR-UHFFFAOYSA-N
- CAS Registry Number: 1187-58-2
- Chemical structure:
View 3d structure (requires JavaScript / HTML 5) - Other names: Propionamide, N-methyl-; N-Methylpropionamide; N-Methylpropionic acid amide; N-Methylpropanamide; N-Methylpropionsaureamid

Condensed phase thermochemistry data

Data compiled as indicated in comments:
ALS - Hussein Y. Afeefy, Joel F. Liebman, and Stephen E. Stein
DH - Eugene S. Domalski and Elizabeth D. Hearing
Quantity | Value | Units | Method | Reference | Comment |
---|---|---|---|---|---|
ΔfH°liquid | -320.1 ± 0.8 | kJ/mol | Ccb | Vasil'eva and Zhil'tsova, 1982 | ALS |
Quantity | Value | Units | Method | Reference | Comment |
ΔcH°liquid | -2539.7 ± 0.8 | kJ/mol | Ccb | Vasil'eva and Zhil'tsova, 1982 | ALS |
Constant pressure heat capacity of liquid
Cp,liquid (J/mol*K) | Temperature (K) | Reference | Comment |
---|---|---|---|
179. | 298.15 | Konicek and Wadso, 1971 | DH |

Phase change data

Data compiled as indicated in comments:
BS - Robert L. Brown and Stephen E. Stein
AC - William E. Acree, Jr., James S. Chickos
Quantity | Value | Units | Method | Reference | Comment |
---|---|---|---|---|---|
ΔvapH° | 66.6 ± 0.2 | kJ/mol | GS | Verevkin, Emel'yanenko, et al., 2009 | Based on data from 307. to 371. K.; AC |
ΔvapH° | 66.9 ± 1.3 | kJ/mol | EB,BG | Morgan and Kopp, 1998 | Based on data from 368. to 473. K.; AC |
ΔvapH° | 64.9 ± 0.3 | kJ/mol | C | Starzewski, Wadso, et al., 1984 | AC |
Reduced pressure boiling point
Tboil (K) | Pressure (bar) | Reference | Comment |
---|---|---|---|
419.2 | 0.12 | Aldrich Chemical Company Inc., 1990 | BS |
Enthalpy of vaporization
ΔvapH (kJ/mol) | Temperature (K) | Method | Reference | Comment |
---|---|---|---|---|
64.0 ± 0.2 | 339. | GS | Verevkin, Emel'yanenko, et al., 2009 | Based on data from 307. to 371. K.; AC |
64.0 ± 0.3 | 420. | EB,BG | Morgan and Kopp, 1998 | Based on data from 368. to 473. K.; AC |
54.2 | 376. | N/A | Schmelzer and Pusch, 1995 | Based on data from 361. to 414. K.; AC |
54.4 | 318. | A | Stephenson and Malanowski, 1987 | Based on data from 303. to 363. K. See also Gopal and Rizvi, 1968.; AC |
56.6 ± 0.2 | 431. | EB | Vasil'eva, 1983 | Based on data from 381. to 480. K. See also Verevkin, Emel'yanenko, et al., 2009.; AC |
63.9 ± 0.2 | 431. | EB | Vasil'eva, 1983 | Based on data from 381. to 480. K. See also Verevkin, Emel'yanenko, et al., 2009.; AC |

Gas phase ion energetics data

Data evaluated as indicated in comments:
HL - Edward P. Hunter and Sharon G. Lias
Data compiled as indicated in comments:
MM - Michael M. Meot-Ner (Mautner)
Quantity | Value | Units | Method | Reference | Comment |
---|---|---|---|---|---|
Proton affinity (review) | 920.4 | kJ/mol | N/A | Hunter and Lias, 1998 | HL |
Quantity | Value | Units | Method | Reference | Comment |
Gas basicity | 889.4 | kJ/mol | N/A | Hunter and Lias, 1998 | HL |
Gas basicity at 298K
Gas basicity (review) (kJ/mol) | Reference | Comment |
---|---|---|
864. ± 5. | Witt and Grutzmacher, 1997 | m-Toluidine. GB upper limit. Data readjusted to Hunter and Lias, 1998; MM |

Kovats' RI, non-polar column, isothermal

Column type | Active phase | Temperature (C) | I | Reference | Comment |
---|---|---|---|---|---|
Packed | SE-30 | 180. | 921. | Krawczyk and Piotrowski, 1989 | N2, Chromosorb W AW; Column length: 1. m |

Normal alkane RI, non-polar column, temperature ramp

Column type | Active phase | I | Reference | Comment |
---|---|---|---|---|
Capillary | OV-101 | 897. | Zenkevich, 2005 | 25. m/0.20 mm/0.10 μm, N2/He, 6. K/min; Tstart: 50. C; Tend: 250. C |

Normal alkane RI, polar column, custom temperature program

Column type | Active phase | I | Reference | Comment |
---|---|---|---|---|
Capillary | DB-Wax | 1645. | Peng, Yang, et al., 1991 | Program: not specified |
Capillary | DB-Wax | 1690. | Peng, Yang, et al., 1991 | Program: not specified |

References

Vasil'eva and Zhil'tsova, 1982
Vasil'eva, T.F.; Zhil'tsova, E.N.,
Heat of combustion of two monomethylamides,
Termodin. Organ. Soedin., 1982, 108-110. [all data]
Konicek and Wadso, 1971
Konicek, J.; Wadso, I.,
Thermochemical properties of some carboxylic acids, amines and N-substituted amides in aqueous solution,
Acta Chem. Scand., 1971, 25, 1541-1551. [all data]
Verevkin, Emel'yanenko, et al., 2009
Verevkin, Sergey P.; Emel'yanenko, Vladimir N.; Toktonov, Alexey V.; Goodrich, Peter; Hardacre, Christopher,
Thermochemistry of Ionic Liquid-Catalyzed Reactions: Theoretical and Experimental Study of the Beckmann Rearrangement---Kinetic or Thermodynamic Control? «8224»,
Ind. Eng. Chem. Res., 2009, 48, 22, 9809-9816, https://doi.org/10.1021/ie900633r
. [all data]
Morgan and Kopp, 1998
Morgan, Kathleen M.; Kopp, Daniel A.,
Solvent effects on the stability of simple secondary amides «8224»,
J. Chem. Soc., Perkin Trans. 2, 1998, 12, 2759-2764, https://doi.org/10.1039/a802717j
. [all data]
Starzewski, Wadso, et al., 1984
Starzewski, P.; Wadso, I.; Zielenkiewicz, W.,
Enthalpies of vaporization of some N-alkylamides at 298.15 K,
J. Chem. Thermodyn., 1984, 16, 331-334. [all data]
Aldrich Chemical Company Inc., 1990
Aldrich Chemical Company Inc.,
Catalog Handbook of Fine Chemicals, Aldrich Chemical Company, Inc., Milwaukee WI, 1990, 1. [all data]
Schmelzer and Pusch, 1995
Schmelzer, Jürgen; Pusch, Jens,
Phase equilibria in binary systems containing N-monosubstituted amides and hydrocarbons,
Fluid Phase Equilibria, 1995, 110, 1-2, 183-196, https://doi.org/10.1016/0378-3812(95)02753-2
. [all data]
Stephenson and Malanowski, 1987
Stephenson, Richard M.; Malanowski, Stanislaw,
Handbook of the Thermodynamics of Organic Compounds, 1987, https://doi.org/10.1007/978-94-009-3173-2
. [all data]
Gopal and Rizvi, 1968
Gopal, R.; Rizvi, S.A.,
J. Indian Chem. Soc., 1968, 45, 1, 13. [all data]
Vasil'eva, 1983
Vasil'eva, T.F.,
Vapor pressure of 3-methoxypropylamine and six substituted amides
in Teplofiz Svoistva Uglevodororov Nefteprod, G.I. Cherednichenko, ed(s)., Ts NIIT Eneftekhim, Moscow, 1983, 85-94. [all data]
Hunter and Lias, 1998
Hunter, E.P.; Lias, S.G.,
Evaluated Gas Phase Basicities and Proton Affinities of Molecules: An Update,
J. Phys. Chem. Ref. Data, 1998, 27, 3, 413-656, https://doi.org/10.1063/1.556018
. [all data]
Witt and Grutzmacher, 1997
Witt, M.; Grutzmacher, H.F.,
Proton-bound dimers of aliphatic carboxamides: gas-phase basicity and dissociation energy,
Int. J. Mass Spectrom. Ion Processes, 1997, 165, 49. [all data]
Krawczyk and Piotrowski, 1989
Krawczyk, W.; Piotrowski, G.T.,
Relationships Between Structure and Retention Index for N-Substituted Amides of Aliphatic Acids on a Non-Polar Column,
J. Chromatogr., 1989, 463, 297-304, https://doi.org/10.1016/S0021-9673(01)84484-8
. [all data]
Zenkevich, 2005
Zenkevich, I.G.,
Experimentally measured retention indices., 2005. [all data]
Peng, Yang, et al., 1991
Peng, C.T.; Yang, Z.C.; Ding, S.F.,
Prediction of rentention idexes. II. Structure-retention index relationship on polar columns,
J. Chromatogr., 1991, 586, 1, 85-112, https://doi.org/10.1016/0021-9673(91)80028-F
. [all data]