N-(N-L-leucylglycyl)glycine
- Formula: C10H19N3O4
- Molecular weight: 245.2756
- IUPAC Standard InChIKey: VWHGTYCRDRBSFI-SSDOTTSWSA-N
- CAS Registry Number: 1187-50-4
- Chemical structure:
View 3d structure (requires JavaScript / HTML 5) - Stereoisomers:
- Other names: Leucylglycylglycine

Condensed phase thermochemistry data

Data compiled by: Hussein Y. Afeefy, Joel F. Liebman, and Stephen E. Stein
Quantity | Value | Units | Method | Reference | Comment |
---|---|---|---|---|---|
ΔcH°solid | -7687.4 | kJ/mol | Ccb | Lemoult, 1904 |

Gas phase ion energetics data

Data evaluated by: Edward P. Hunter and Sharon G. Lias
Quantity | Value | Units | Method | Reference | Comment |
---|---|---|---|---|---|
Gas basicity | 926.7 | kJ/mol | N/A | Hunter and Lias, 1998 |

References

Lemoult, 1904
Lemoult, M.P.,
Remarques sur une serie recenie de determinations calorimetriques,
Compt. Rend., 1904, 663-635. [all data]
Hunter and Lias, 1998
Hunter, E.P.; Lias, S.G.,
Evaluated Gas Phase Basicities and Proton Affinities of Molecules: An Update,
J. Phys. Chem. Ref. Data, 1998, 27, 3, 413-656, https://doi.org/10.1063/1.556018
. [all data]