2,4-hexadiene, 3,4-dimethyl-

Phase change data

Data compiled by: Thermodynamics Research Center, NIST Boulder Laboratories, Chris Muzny director

Quantity Value Units Method Reference Comment
Tboil387.8KN/AGostunskaya, Krasnyanskaya, et al., 1955Uncertainty assigned by TRC = 2. K

In addition to the Thermodynamics Research Center (TRC) data available from this site, much more physical and chemical property data is available from the following TRC products:

References

Gostunskaya, Krasnyanskaya, et al., 1955
Gostunskaya, I.V.; Krasnyanskaya, E.A.; Kazanskii, B.A., Zh. Obshch. Khim., 1955, 25, 1448. [all data]