Trifluorovinyl sulfur pentafluoride

Phase change data

Data compiled by: William E. Acree, Jr., James S. Chickos

Enthalpy of vaporization

ΔvapH (kJ/mol) Temperature (K) Reference
25.1292.Case, Ray, et al., 1961

References

Case, Ray, et al., 1961
Case, J.R.; Ray, N.H.; Roberts, H.L., 394. Sulphur chloride pentafluoride: reaction with fluoro-olefins, J. Chem. Soc., 1961, 2070, https://doi.org/10.1039/jr9610002070 . [all data]