Benzoic acid, 2-hydroxy-, ethyl ester
- Formula: C9H10O3
- Molecular weight: 166.1739
- IUPAC Standard InChIKey: GYCKQBWUSACYIF-UHFFFAOYSA-N
- CAS Registry Number: 118-61-6
- Chemical structure:
View 3d structure (requires JavaScript / HTML 5) - Other names: Salicylic acid, ethyl ester; Ethyl o-hydroxybenzoate; Ethyl salicylate; Ethyl 2-hydroxybenzoate; Mesotol; Sal ethyl; Salotan; o-(Ethoxycarbonyl)phenol; 2-Hydroxybenzoic acid ethyl ester; Salicylic ether; NSC 8209

Phase change data

Data compiled as indicated in comments:
BS - Robert L. Brown and Stephen E. Stein
TRC - Thermodynamics Research Center, NIST Boulder Laboratories, Chris Muzny director
AC - William E. Acree, Jr., James S. Chickos
Quantity | Value | Units | Method | Reference | Comment |
---|---|---|---|---|---|
Tboil | 507.2 | K | N/A | Aldrich Chemical Company Inc., 1990 | BS |
Tboil | 506.95 | K | N/A | Lecat, 1947 | Uncertainty assigned by TRC = 0.5 K; TRC |
Tboil | 495.50 | K | N/A | Lecat, 1926 | Uncertainty assigned by TRC = 0.5 K; TRC |
Tboil | 506.9 | K | N/A | Perkin, 1896 | Uncertainty assigned by TRC = 1. K; TRC |
Tboil | 504.65 | K | N/A | Kahlbaum, 1884 | Uncertainty assigned by TRC = 1.5 K; TRC |
Enthalpy of vaporization
ΔvapH (kJ/mol) | Temperature (K) | Method | Reference | Comment |
---|---|---|---|---|
59.2 | 303. | A | Stephenson and Malanowski, 1987 | Based on data from 288. to 333. K.; AC |
55.2 | 349. | A | Stephenson and Malanowski, 1987 | Based on data from 334. to 505. K.; AC |
53.4 | 431. to 461. | N/A | Wayaku, 1982 | AC |

Normal alkane RI, non-polar column, temperature ramp

Data compiled by: NIST Mass Spectrometry Data Center, William E. Wallace, director

Column type CapillaryCapillaryCapillaryCapillaryCapillary
Active phase HP-5 MSRTX-5Elite-5MSHP-5HP-5MS
Column length (m) 30.10.30.60.30.
Carrier gas HeliumHeHeHeHe
Substrate
Column diameter (mm) 0.250.180.320.250.25
Phase thickness (μm) 0.250.20.50.250.25
Tstart (C) 50.40.40.60.60.
Tend (C) 320.275.280.250.285.
Heat rate (K/min) 5.50.4.3.4.3
Initial hold (min) 5.0.55.
Final hold (min)  0.510.
I 1270.1279.1269.1272.1267.
ReferenceNawrath, Mgode, et al., 2012Setkova, Risticevic, et al., 2007Tava, Pecetti, et al., 2007Bertrand, Comte, et al., 2006Tesevic, Nikicevic, et al., 2005
Comment MSDC-RI MSDC-RI MSDC-RI MSDC-RI MSDC-RI
Column type CapillaryCapillaryCapillaryCapillaryCapillary
Active phase DB-5HP-1DB-1Ultra-1HP-5
Column length (m) 30.25.60.25.50.
Carrier gas HeH2HeHeH2
Substrate
Column diameter (mm) 0.2490.320.320.320.3
Phase thickness (μm) 0.250.170.250.25
Tstart (C) 60.40.60.80.80.
Tend (C) 300.260.220.260.250.
Heat rate (K/min) 3.3.3.3.16.
Initial hold (min)  5.
Final hold (min)
I 1265.1240.1249.1238.1257.
ReferenceWoerdenbag, Windono, et al., 2004Lopes, Koketsu, et al., 1999Werkhoff and Güntert, 1997Okumura, 1991Spadone, Takeoka, et al., 1990
Comment MSDC-RI MSDC-RI MSDC-RI MSDC-RI MSDC-RI
Column type CapillaryCapillary
Active phase HP-5DB-1
Column length (m) 50.60.
Carrier gas H2
Substrate
Column diameter (mm) 0.30.32
Phase thickness (μm)
Tstart (C) 80.50.
Tend (C) 250.250.
Heat rate (K/min) 16.4.
Initial hold (min)  0.1
Final hold (min)  5.
I 1280.1243.
ReferenceSpadone, Takeoka, et al., 1990Flath, Mon, et al., 1983
Comment MSDC-RI MSDC-RI

Normal alkane RI, non-polar column, custom temperature program

Data compiled by: NIST Mass Spectrometry Data Center, William E. Wallace, director

Column type CapillaryCapillaryCapillaryCapillaryCapillary
Active phase Polydimethyl siloxane with 5 % Ph groupsPolydimethyl siloxane with 5 % Ph groupsCP-Sil 5 CbDB-5 MSSE-30
Column length (m)   50.30.
Carrier gas   NitrogenHelium
Substrate
Column diameter (mm)   0.320.25
Phase thickness (μm)   1.200.25
Program not specifiednot specified40 0C 20 0C/min -> 85 0C 1 0C/min -> 145 0C 3 0C/min -> 250 0C (30 min)45 0C (0.75 min) 10 0C/min -> 200 0C 30 0C/min -> 245 0C (1.25 min)not specified
I 1267.1279.1255.1286.1257.
ReferenceRobinson, Adams, et al., 2012Robinson, Adams, et al., 2012Collin, Nizet, et al., 2008Cajka, Hajslova, et al., 2007Vinogradov, 2004
Comment MSDC-RI MSDC-RI MSDC-RI MSDC-RI MSDC-RI
Column type CapillaryCapillaryCapillary
Active phase OV-101OV-101OV-1, SE-30, Methyl silicone, SP-2100, OV-101, DB-1, etc.
Column length (m) 25.50.50.
Carrier gas HeHeHydrogen
Substrate
Column diameter (mm) 0.310.240.32
Phase thickness (μm)
Program not specifiednot specifiednot specified
I 1257.1249.1261.
ReferenceMorales and Duque, 1987Zenkevich and Malamakhov, 1987Waggott and Davies, 1984
Comment MSDC-RI MSDC-RI MSDC-RI

References

Aldrich Chemical Company Inc., 1990
Aldrich Chemical Company Inc.,
Catalog Handbook of Fine Chemicals, Aldrich Chemical Company, Inc., Milwaukee WI, 1990, 1. [all data]
Lecat, 1947
Lecat, M.,
Some azeotropes of which one constituant is heterocyclic nitrogen,
Ann. Soc. Sci. Bruxelles, Ser. 1, 1947, 61, 73. [all data]
Lecat, 1926
Lecat, M.,
New binary azeotropes: 3rd list,
Ann. Soc. Sci. Bruxelles, Ser. B, 1926, 45, 284-94. [all data]
Perkin, 1896
Perkin, W.H.,
LXIX. On Magnetic Rotatory Power, especially of Aromatic Compounds,
J. Chem. Soc., 1896, 69, 1025-1257. [all data]
Kahlbaum, 1884
Kahlbaum, G.W.A.,
The dependence of Boiling Temperature on Air Pressure,
Ber. Dtsch. Chem. Ges., 1884, 17, 1245. [all data]
Stephenson and Malanowski, 1987
Stephenson, Richard M.; Malanowski, Stanislaw,
Handbook of the Thermodynamics of Organic Compounds, 1987, https://doi.org/10.1007/978-94-009-3173-2
. [all data]
Wayaku, 1982
Wayaku, M.,
Equations between vapor pressure and temperature for chemical substances. IV,
Aromatikkusu, 1982, 34, 9/10, 219. [all data]
Lang (editor), 1965
Lang (editor), L.,
Absorption Spectra in the Ultraviolet and Visible Region, 1965, 5, 57. [all data]