1-Butanol, 2,2-dimethyl-
- Formula: C6H14O
- Molecular weight: 102.1748
- IUPAC Standard InChIKey: XRMVWAKMXZNZIL-UHFFFAOYSA-N
- CAS Registry Number: 1185-33-7
- Chemical structure:
View 3d structure (requires JavaScript / HTML 5) - Other names: 2,2-Dimethyl-1-butanol; 2,2-Dimethylbutanol; 2,2-dimethylbutan-1-ol

Phase change data

Data compiled as indicated in comments:
TRC - Thermodynamics Research Center, NIST Boulder Laboratories, Chris Muzny director
AC - William E. Acree, Jr., James S. Chickos
Quantity | Value | Units | Method | Reference | Comment |
---|---|---|---|---|---|
Tboil | 409. ± 2. | K | AVG | N/A | Average of 12 values; Individual data points |
Enthalpy of vaporization
ΔvapH (kJ/mol) | Temperature (K) | Method | Reference | Comment |
---|---|---|---|---|
47.2 | 371. | A | Stephenson and Malanowski, 1987 | Based on data from 356. to 415. K.; AC |
53.7 | 313. | N/A | Wilhoit and Zwolinski, 1973 | Based on data from 298. to 415. K.; AC |
52.1 | 313. | I | Hovorka, Lankelma, et al., 1940 | Based on data from 298. to 408. K.; AC |

References

Stephenson and Malanowski, 1987
Stephenson, Richard M.; Malanowski, Stanislaw,
Handbook of the Thermodynamics of Organic Compounds, 1987, https://doi.org/10.1007/978-94-009-3173-2
. [all data]
Wilhoit and Zwolinski, 1973
Wilhoit, R.C.; Zwolinski, B.J.,
Physical and thermodynamic properties of aliphatic alcohols,
J. Phys. Chem. Ref. Data Suppl., 1973, 1, 2, 1. [all data]
Hovorka, Lankelma, et al., 1940
Hovorka, Frank; Lankelma, Herman P.; Smith, W. Rusler,
Thermodynamic Properties of the Hexyl Alcohols. V. 2,2-Dimethylbutanol-1 and 2-Ethylbutanol-1,
J. Am. Chem. Soc., 1940, 62, 9, 2372-2374, https://doi.org/10.1021/ja01866a032
. [all data]