Difluorodinitromethane
- Formula: CF2N2O4
- Molecular weight: 142.0185
- IUPAC Standard InChIKey: PLHQSNSLBKPCTC-UHFFFAOYSA-N
- CAS Registry Number: 1185-11-1
- Chemical structure:
View 3d structure (requires JavaScript / HTML 5) - Permanent link for this species. Use this link for bookmarking this species for future reference.

Phase change data

Data compiled as indicated in comments:
ALS - Hussein Y. Afeefy, Joel F. Liebman, and Stephen E. Stein
AC - William E. Acree, Jr., James S. Chickos
Quantity | Value | Units | Method | Reference | Comment |
---|---|---|---|---|---|
ΔvapH° | 41. ± 0.8 | kJ/mol | V | Pepekin, Lebedev, et al., 1973 | hf_HF.30H2O=-77.01 kcal/mol; ALS |
Enthalpy of vaporization
ΔvapH (kJ/mol) | Temperature (K) | Method | Reference | Comment |
---|---|---|---|---|
41.4 | 296. | A | Stephenson and Malanowski, 1987 | Based on data from 283. to 310. K. See also Pepekin, Lebedev, et al., 1973, 2.; AC |

Condensed phase thermochemistry data

Data compiled by: Hussein Y. Afeefy, Joel F. Liebman, and Stephen E. Stein
Quantity | Value | Units | Method | Reference | Comment |
---|---|---|---|---|---|
ΔfH°liquid | -444.8 ± 6.7 | kJ/mol | Ccb | Pepekin, Lebedev, et al., 1973 | hf_HF.30H2O=-77.01 kcal/mol |
Quantity | Value | Units | Method | Reference | Comment |
ΔcH°liquid | -307. ± 5.9 | kJ/mol | Ccb | Pepekin, Lebedev, et al., 1973 | hf_HF.30H2O=-77.01 kcal/mol |

Gas phase thermochemistry data

Data compiled by: Hussein Y. Afeefy, Joel F. Liebman, and Stephen E. Stein
Quantity | Value | Units | Method | Reference | Comment |
---|---|---|---|---|---|
ΔfH°gas | -403. ± 6.7 | kJ/mol | Ccb | Pepekin, Lebedev, et al., 1973 | hf_HF.30H2O=-77.01 kcal/mol |

References

Pepekin, Lebedev, et al., 1973
Pepekin, V.I.; Lebedev, Yu.A.; Apin, A.Ya.,
Dissociation energies of C-F and C-C bonds in α-fluoronitro derivatives of methane and ethane,
Dokl. Akad. Nauk SSSR, 1973, 208, 153-155. [all data]
Stephenson and Malanowski, 1987
Stephenson, Richard M.; Malanowski, Stanislaw,
Handbook of the Thermodynamics of Organic Compounds, 1987, https://doi.org/10.1007/978-94-009-3173-2
. [all data]
Pepekin, Lebedev, et al., 1973, 2
Pepekin, V.I.; Lebedev, Y.A.; Apin, A.Y.,
Dokl. Phys. Chem., 1973, 208, 35. [all data]