3-methyl-2,3,4-pentanetriol

Phase change data

Data compiled by: Thermodynamics Research Center, NIST Boulder Laboratories, Chris Muzny director

Quantity Value Units Method Reference Comment
Tfus401.KN/AColonge and Vaginary, 1965Uncertainty assigned by TRC = 5. K

In addition to the Thermodynamics Research Center (TRC) data available from this site, much more physical and chemical property data is available from the following TRC products:

References

Colonge and Vaginary, 1965
Colonge, J.; Vaginary, Y., Bull. Soc. Chim. Fr., 1965, 1965, 3140. [all data]