Benzoic acid, 3,4,5-trimethoxy-
- Formula: C10H12O5
- Molecular weight: 212.1993
- IUPAC Standard InChIKey: SJSOFNCYXJUNBT-UHFFFAOYSA-N
- CAS Registry Number: 118-41-2
- Chemical structure:
View 3d structure (requires JavaScript / HTML 5) - Other names: Eudesmic acid; Gallic acid trimethyl ether; Tri-O-methylgallic acid; Veratric acid, 5-methoxy-; 3,4,5-Trimethoxybenzoic acid; Trimethylgallic acid; NSC 2525

Phase change data

Data compiled as indicated in comments:
BS - Robert L. Brown and Stephen E. Stein
AC - William E. Acree, Jr., James S. Chickos
Quantity | Value | Units | Method | Reference | Comment |
---|---|---|---|---|---|
ΔsubH° | 131.2 ± 0.8 | kJ/mol | ME | Roux, Jiménez, et al., 2001 | AC |
Reduced pressure boiling point
Tboil (K) | Pressure (bar) | Reference | Comment |
---|---|---|---|
499.2 | 0.013 | Weast and Grasselli, 1989 | BS |
Enthalpy of sublimation
ΔsubH (kJ/mol) | Temperature (K) | Method | Reference | Comment |
---|---|---|---|---|
127.9 ± 0.8 | 363. | ME | Roux, Jiménez, et al., 2001 | Based on data from 354. to 372. K.; AC |
Enthalpy of fusion
ΔfusH (kJ/mol) | Temperature (K) | Method | Reference | Comment |
---|---|---|---|---|
29.9 | 444.5 | DSC | Huang, 2003 | See also Huang, Tang, et al., 2005.; AC |

Van Den Dool and Kratz RI, non-polar column, custom temperature program

Column type | Active phase | I | Reference | Comment |
---|---|---|---|---|
Capillary | HP-5MS | 1771.8 | Andriamaharavo, 2014 | 30. m/0.25 mm/0.25 μm, He; Program: 60C (1 min) => 5 C/min => 210C => 10 C/min => 280C (15 min) |

References

Roux, Jiménez, et al., 2001
Roux, Maria Victoria; Jiménez, Pilar; Mayorga, Paola-Andrea; Dávalos, Juan Z.; Böhm, Stanislav; Exner, Otto,
Energy of Crowded Molecules: 3,4,5-Trimethoxybenzoic Acid,
J. Phys. Chem. A, 2001, 105, 33, 7926-7932, https://doi.org/10.1021/jp011188r
. [all data]
Weast and Grasselli, 1989
CRC Handbook of Data on Organic Compounds, 2nd Editon, Weast,R.C and Grasselli, J.G., ed(s)., CRC Press, Inc., Boca Raton, FL, 1989, 1. [all data]
Huang, 2003
Huang, C.-Y.,
, M.S. Thesis, Chinese Culture University, 2003. [all data]
Huang, Tang, et al., 2005
Huang, Chih-Yung; Tang, Muoi; Chen, Yan-Ping,
Solid-Liquid Equilibria for 3-Aminophenol + 2-Aminophenol, 4-(Acetylamino)toluene + 2-(Acetylamino)toluene, and 3,4,5-Trimethoxybenzoic Acid + 2,4,5-Trimethoxybenzoic Acid,
J. Chem. Eng. Data, 2005, 50, 1, 40-43, https://doi.org/10.1021/je049878m
. [all data]
Kofod and Jorgensen, 1955
Kofod, H.; Jorgensen, C.,
Acta Chem. Scand, 1955, 9, 1327. [all data]
Andriamaharavo, 2014
Andriamaharavo, N.R.,
Retention Data. NIST Mass Spectrometry Data Center., NIST Mass Spectrometry Data Center, 2014. [all data]