Guanosine
- Formula: C10H13N5O2
- Molecular weight: 235.2425
- IUPAC Standard InChIKey: NYHBQMYGNKIUIF-UUOKFMHZSA-N
- CAS Registry Number: 118-00-3
- Chemical structure:
View 3d structure (requires JavaScript / HTML 5) - Stereoisomers:
- Other names: Guanine, 9β-d-ribofuranosyl-; β-D-Ribofuranoside, guanine-9; Guanozin; Guo; Inosine, 2-amino-; Vernine; 2-Amino-1,9-dihydro-9β-d-ribofuranosyl-6H-purin-6-one; 6H-Purin-6-one, 2-amino-1,9-dihydro-9-β-D-ribofuranosyl-; Guanine riboside; Guanine-9-β-D-ribofuranoside; Ribofuranoside, guanine-9, β-D-; USAF CB-11; 2(3H)-Imino-9-β-D-ribofuranosyl-9H-purin-6(1H)-one; 9-β-D-ribofuranosylguanine; dl-Guanosine; NSC 19994; Guanosine, anhydrous

Gas phase ion energetics data

Data evaluated by: Edward P. Hunter and Sharon G. Lias
Quantity | Value | Units | Method | Reference | Comment |
---|---|---|---|---|---|
Proton affinity (review) | 237.4 | kcal/mol | N/A | Hunter and Lias, 1998 | |
Quantity | Value | Units | Method | Reference | Comment |
Gas basicity | 229.7 | kcal/mol | N/A | Hunter and Lias, 1998 |

References

Hunter and Lias, 1998
Hunter, E.P.; Lias, S.G.,
Evaluated Gas Phase Basicities and Proton Affinities of Molecules: An Update,
J. Phys. Chem. Ref. Data, 1998, 27, 3, 413-656, https://doi.org/10.1063/1.556018
. [all data]