CAS Reg. No. 117951-42-5
- CAS Registry Number: 117951-42-5

Reaction thermochemistry data

Data compiled by: John E. Bartmess
Individual Reactions
(CAS Reg. No. 117951-42-5 • 4294967295) +
= CAS Reg. No. 117951-42-5
By formula: (CAS Reg. No. 117951-42-5 • 4294967295C5H10O) + C5H10O = CAS Reg. No. 117951-42-5
Quantity | Value | Units | Method | Reference | Comment |
---|---|---|---|---|---|
ΔrH° | 175. ± 8.8 | kJ/mol | N/A | Haas and Harrison, 1993 | gas phase; Both metastable and 50 eV collision energy. |
ΔrH° | 173. ± 12. | kJ/mol | Ther | Boand, Houriet, et al., 1983 | gas phase; value altered from reference due to change in acidity scale |

References

Haas and Harrison, 1993
Haas, M.J.; Harrison, A.G.,
The Fragmentation of Proton-Bound Cluster Ions and the Gas-Phase Acidities of Alcohols,
Int. J. Mass Spectrom. Ion Proc., 1993, 124, 2, 115, https://doi.org/10.1016/0168-1176(93)80003-W
. [all data]
Boand, Houriet, et al., 1983
Boand, G.; Houriet, R.; Baumann, T.,
The gas phase acidity of aliphatic alcohols,
J. Am. Chem. Soc., 1983, 105, 2203. [all data]