Benzene, 1,2,4,5-tetrachloro-3-nitro-
- Formula: C6HCl4NO2
- Molecular weight: 260.890
- IUPAC Standard InChIKey: XQTLDIFVVHJORV-UHFFFAOYSA-N
- CAS Registry Number: 117-18-0
- Chemical structure:
View 3d structure (requires JavaScript / HTML 5) - Other names: Chipman 3,142; Folosan; Folosan DB-905; Fusarex; Myfusan; Tecnazen; Tetrachloronitrobenzene; TCNB; 1,2,4,5-Tetrachloro-3-Nitrobenzene; 2,3,5,6-Tetrachloro-1-nitrobenzene; 2,3,5,6-Tetrachloronitrobenzene; Benzene, 3-nitro-1,2,4,5-tetrachloro-; 2,3,5,6-Tetrachlor-3-nitrobenzol; DB 905; Teknazen; Chipman 3142; Napotate; Nebulin; Arena; Bygran; Easytec; Hickstor; Hystore; Hytec; New Hystor; Tecnazene; Turbostore; 1-Nitro-2,3,5,6-tetrachlorobenzene

Phase change data

Data compiled as indicated in comments:
BS - Robert L. Brown and Stephen E. Stein
TRC - Thermodynamics Research Center, NIST Boulder Laboratories, Chris Muzny director
AC - William E. Acree, Jr., James S. Chickos
Quantity | Value | Units | Method | Reference | Comment |
---|---|---|---|---|---|
Tboil | 577.2 | K | N/A | Weast and Grasselli, 1989 | BS |
Quantity | Value | Units | Method | Reference | Comment |
Tfus | 373.55 | K | N/A | Donnelly, Drewes, et al., 1990 | Uncertainty assigned by TRC = 0.2 K; TRC |
Quantity | Value | Units | Method | Reference | Comment |
ΔsubH° | 21.8 ± 0.60 | kcal/mol | C | Ribeiro da Silva, Lobo Ferreira, et al., 2009 | AC |
Enthalpy of fusion
ΔfusH (kcal/mol) | Temperature (K) | Method | Reference | Comment |
---|---|---|---|---|
4.651 | 373.3 | DSC | Acree, 1991 | See also Donnelly, Drewes, et al., 1990, 2.; AC |

Normal alkane RI, non-polar column, custom temperature program

Column type | Active phase | I | Reference | Comment |
---|---|---|---|---|
Capillary | 5 % Phenyl methyl siloxane | 1594. | Department of Food Safety and Welfare, 2006 | 30. m/0.25 mm/0.25 μm, Helium; Program: 50 0C(1 min) 25 0C/min -> 125 0C 10 0C/min -> 300 0C (10 min) |

References

Weast and Grasselli, 1989
CRC Handbook of Data on Organic Compounds, 2nd Editon, Weast,R.C and Grasselli, J.G., ed(s)., CRC Press, Inc., Boca Raton, FL, 1989, 1. [all data]
Donnelly, Drewes, et al., 1990
Donnelly, J.R.; Drewes, L.A.; Johnson, R.L.; Munslow, W.D.; Knapp, K.K.; Sovocool, G.W.,
Purity and heat of fusion data for environmental standards as determined by differential scanning calorimetry,
Thermochim. Acta, 1990, 167, 2, 155, https://doi.org/10.1016/0040-6031(90)80476-F
. [all data]
Ribeiro da Silva, Lobo Ferreira, et al., 2009
Ribeiro da Silva, Manuel A.V.; Lobo Ferreira, Ana I.M.C.; Cabral, Joana I.T.A.; Santos, Ana Filipa L.O.M.; Moreno, Ana Rita G.; Galvão, Tiago L.P.; Rocha, Inês M.; Fernandes, Paula M.V.; Salgueiro, Sílvia Q.; de Moura, Vanessa A.F.; Oliveira, Isabel M.S.C.; Cotelo, Paula C.; Ribeiro, Mariana R.A.,
Experimental and computational thermochemical study of the tri-, tetra-, and pentachloronitrobenzene isomers,
The Journal of Chemical Thermodynamics, 2009, 41, 9, 984-991, https://doi.org/10.1016/j.jct.2009.03.014
. [all data]
Acree, 1991
Acree, William E.,
Thermodynamic properties of organic compounds: enthalpy of fusion and melting point temperature compilation,
Thermochimica Acta, 1991, 189, 1, 37-56, https://doi.org/10.1016/0040-6031(91)87098-H
. [all data]
Donnelly, Drewes, et al., 1990, 2
Donnelly, J.R.; Drewes, L.A.; Johnson, R.L.; Munslow, W.D.; Knapp, K.K.; Sovocool, G.W.,
Purity and heat of fusion data for environmental standards as determined by differential scanning calorimetry,
Thermochimica Acta, 1990, 167, 2, 155-187, https://doi.org/10.1016/0040-6031(90)80476-F
. [all data]
Department of Food Safety and Welfare, 2006
Department of Food Safety, Ministry of Health; Welfare,
Analytical methods for residual compositional substances of agricultural chemicals, feed aadditives, and veterinary drugs in foods, 2006, retrieved from http://www.mhlw.go.jp/english/topics/foodsafety/positivelist060228/de/060526-1a.pdf. [all data]