1,2-Dibromoethane-d3
- Formula: C2HD3Br2
- Molecular weight: 190.880
- IUPAC Standard InChIKey: PAAZPARNPHGIKF-APAIHEESSA-N
- CAS Registry Number: 117164-17-7
- Chemical structure:
View 3d structure (requires JavaScript / HTML 5) - Isotopologues:

Condensed phase thermochemistry data

Data compiled by: Eugene S. Domalski and Elizabeth D. Hearing
Constant pressure heat capacity of liquid
Cp,liquid (J/mol*K) | Temperature (K) | Reference |
---|---|---|
144.3 | 293. | D'hont and Jungers, 1949 |
145.14 | 310. | Wuyts and Jungers, 1949 |

References

D'hont and Jungers, 1949
D'hont, M.; Jungers, J.C.,
La chaleur molaire des 1,1'-dibromethanes et 1,1',2-tribromethanes en phase liquide,
Bull. Soc. Chim. Belg., 1949, 58, 196-204. [all data]
Wuyts and Jungers, 1949
Wuyts, J.; Jungers, J.C.,
Les chaleurs molaires des bibromures de deuteroethylene,
Bull. Soc. Chim. Belg., 1949, 58, 80-86. [all data]