Exo-5-vinylbicyclo[2,2,1]hept-2-ene
- Formula: C9H12
- Molecular weight: 120.1916
- IUPAC Standard InChIKey: INYHZQLKOKTDAI-UHFFFAOYSA-N
- CAS Registry Number: 117110-18-6
- Chemical structure:
View 3d structure (requires JavaScript / HTML 5) - Species with the same structure:
- Stereoisomers:

Phase change data

Data compiled by: Donald R. Burgess, Jr.
Quantity | Value | Units | Method | Reference | Comment |
---|---|---|---|---|---|
ΔvapH° | 42.2 | kJ/mol | N/A | Kozina, Timofeeva, et al., 1972 |

References

Kozina, Timofeeva, et al., 1972
Kozina, M.P.; Timofeeva, L.P.; Pimenova, S.M.; Aleshina, V.A.; Belikova, N.A.; Bobyleva, A.A.; Plate, A.F.,
Enthalpies of combustion and of formation of 4-vinylcyclohexene and of certain bicyclic compounds,
Russ. J. Phys. Chem. (Engl. Transl.), 1972, 46, 1689-1690. [all data]