Endo-5-vinylbicyclo[2.2.1]hept-2-ene
- Formula: C9H12
- Molecular weight: 120.1916
- IUPAC Standard InChIKey: INYHZQLKOKTDAI-MGURRDGZSA-N
- CAS Registry Number: 117110-17-5
- Chemical structure:
View 3d structure (requires JavaScript / HTML 5) - Stereoisomers:

Gas phase thermochemistry data

Data compiled by: Hussein Y. Afeefy, Joel F. Liebman, and Stephen E. Stein
Quantity | Value | Units | Method | Reference | Comment |
---|---|---|---|---|---|
ΔfH°gas | 157. ± 2. | kJ/mol | Ccb | Kozina, Timofeeva, et al., 1972 | Has 35% exo |

Condensed phase thermochemistry data

Data compiled by: Hussein Y. Afeefy, Joel F. Liebman, and Stephen E. Stein
Quantity | Value | Units | Method | Reference | Comment |
---|---|---|---|---|---|
ΔfH°liquid | 114.8 ± 1.7 | kJ/mol | Ccb | Kozina, Timofeeva, et al., 1972 | Has 35% exo |
Quantity | Value | Units | Method | Reference | Comment |
ΔcH°liquid | -5371.4 ± 1.6 | kJ/mol | Ccb | Kozina, Timofeeva, et al., 1972 | Has 35% exo; Corresponding ΔfHºliquid = 114.9 kJ/mol (simple calculation by NIST; no Washburn corrections) |

Phase change data

Data compiled by: Donald R. Burgess, Jr.
Quantity | Value | Units | Method | Reference | Comment |
---|---|---|---|---|---|
ΔvapH° | 42.2 | kJ/mol | N/A | Kozina, Timofeeva, et al., 1972 |

References

Kozina, Timofeeva, et al., 1972
Kozina, M.P.; Timofeeva, L.P.; Pimenova, S.M.; Aleshina, V.A.; Belikova, N.A.; Bobyleva, A.A.; Plate, A.F.,
Enthalpies of combustion and of formation of 4-vinylcyclohexene and of certain bicyclic compounds,
Russ. J. Phys. Chem. (Engl. Transl.), 1972, 46, 1689-1690. [all data]