Danthron
- Formula: C14H8O4
- Molecular weight: 240.2109
- IUPAC Standard InChIKey: QBPFLULOKWLNNW-UHFFFAOYSA-N
- CAS Registry Number: 117-10-2
- Chemical structure:
View 3d structure (requires JavaScript / HTML 5) - Other names: 9,10-Anthracenedione, 1,8-dihydroxy-; Anthraquinone, 1,8-dihydroxy-; Altan; Antrapurol; Chrysazin; Dantron; Diaquone; Dionone; Dorbane; Istin; Istizin; Laxanorm; Laxanthreen; Laxipur; Laxipurin; Zwitsalax; 1,8-Dihydroxy-9,10-anthraquinone; 1,8-Dihydroxyanthraquinone; Danivac; LTAN; USAF ND-59; 1,8-Dihydroxyanthrachinon; Criasazin; 1,8-Dihydroxy-9,10-anthracenedione; Duolax; Modane; Prugol; Roydan; Dantrone; NSC 38626; NSC 646568

Phase change data

Data compiled by: William E. Acree, Jr., James S. Chickos
Quantity | Value | Units | Method | Reference | Comment |
---|---|---|---|---|---|
ΔsubH° | 110. ± 8. | kJ/mol | N/A | Beynon and Nicholson, 2002 |
Enthalpy of sublimation
ΔsubH (kJ/mol) | Temperature (K) | Method | Reference | Comment |
---|---|---|---|---|
106. ± 8. | 404. | HSA | Beynon and Nicholson, 2002 | |
123. | 368. | ME | Hoyer and Peperle, 1958 | Based on data from 333. to 403. K. See also Stephenson and Malanowski, 1987. |

References

Beynon and Nicholson, 2002
Beynon, J.H.; Nicholson, G.R.,
A radioactive ionization gauge and its application to the measurement of latent heat of vaporization,
J. Sci. Instrum., 2002, 33, 10, 376-380, https://doi.org/10.1088/0950-7671/33/10/302
. [all data]
Hoyer and Peperle, 1958
Hoyer, H.; Peperle, W.,
Z. Elektrochem., 1958, 62, 61. [all data]
Stephenson and Malanowski, 1987
Stephenson, Richard M.; Malanowski, Stanislaw,
Handbook of the Thermodynamics of Organic Compounds, 1987, https://doi.org/10.1007/978-94-009-3173-2
. [all data]