9,10-Anthracenedione, 1-amino-4-hydroxy-
- Formula: C14H9NO3
- Molecular weight: 239.2262
- IUPAC Standard InChIKey: AQXYVFBSOOBBQV-UHFFFAOYSA-N
- CAS Registry Number: 116-85-8
- Chemical structure:
View 3d structure (requires JavaScript / HTML 5) - Other names: Anthraquinone, 1-amino-4-hydroxy-; Acetate Fast Red 2B; Acetoquinone Light Gooseberry RL; Acetylon Fast Pink B; Amacel Pink B; Artisil Direct Red 3BP; Artisil Red 3BP; C.I. Disperse Red 15; C.I. 60710; Calcosyn Pink B; Celanthrene Red 3BN; Celliton Fast Pink BA-CF; Celliton Fast Pink BN; Celutate Pink B; Celutate Pink BN; Celutate Pink BY; Cibacet Red E3B; Cibacet Red 3B; Cibacete Red 3B; Cilla Fast Pink BN; Diacelliton Fast Pink B; Disperse Fast Pink B; Disperse Red 15; Disperse Red 2S; Duranol Red 2B; Fenacet Fast Pink B; Interchem Acetate Pink BLF; Interchem Hisperse Pink BH; Microsetile Pink BN; Nacelan Pink B; Neosetile Pink BN; Para M; Perliton Pink 3B; Serisol Fast Red 2B; Setacyl Pink 3B; Supracet Brilliant Red 2B; 1-Amino-4-hydroxyanthraquinone; 4-Amino-1-hydroxyanthraquinone; 1-Amino-4-oxyanthraquinone; 1-Hydroxy-4-aminoanthraquinone; 1a-4oa; 4-Hydroxy-1-anthraquinonylamine; Cerven disperzni 15; C.I. Solvent red 53; Disperse red 25; Dispersol orange D-G; Oracet red 3B; NSC 1485

Phase change data

Data compiled by: William E. Acree, Jr., James S. Chickos
Enthalpy of sublimation
ΔsubH (kcal/mol) | Temperature (K) | Method | Reference | Comment |
---|---|---|---|---|
31.38 | 428. | A | Stephenson and Malanowski, 1987 | Based on data from 418. to 438. K. See also Rodionova, Krutovskaya, et al., 1980. |
34.4 | 458.5 | A | Stephenson and Malanowski, 1987 | Based on data from 444. to 473. K. |

References

Stephenson and Malanowski, 1987
Stephenson, Richard M.; Malanowski, Stanislaw,
Handbook of the Thermodynamics of Organic Compounds, 1987, https://doi.org/10.1007/978-94-009-3173-2
. [all data]
Rodionova, Krutovskaya, et al., 1980
Rodionova, G.N.; Krutovskaya, I.V.; Rodionov, A.N.; Tuchin, Y.G.; Karpov, V.V.,
Zh. Prikl. Spektrosk., 1980, 32, 623. [all data]