Acetic acid, dichloro-, methyl ester
- Formula: C3H4Cl2O2
- Molecular weight: 142.969
- IUPAC Standard InChIKey: HKMLRUAPIDAGIE-UHFFFAOYSA-N
- CAS Registry Number: 116-54-1
- Chemical structure:
View 3d structure (requires JavaScript / HTML 5) - Other names: Dichloroacetic acid methyl ester; Methyl dichloroacetate; UN 2299

Condensed phase thermochemistry data

Data compiled by: Hussein Y. Afeefy, Joel F. Liebman, and Stephen E. Stein
Quantity | Value | Units | Method | Reference | Comment |
---|---|---|---|---|---|
ΔcH°liquid | -1316. ± 4. | kJ/mol | Ccb | Smith, Bjellerup, et al., 1953 | At 291.7 °K |
ΔcH°liquid | -1312. | kJ/mol | Ccb | Schjanberg, 1935 |

Phase change data

Data compiled as indicated in comments:
BS - Robert L. Brown and Stephen E. Stein
TRC - Thermodynamics Research Center, NIST Boulder Laboratories, Chris Muzny director
ALS - Hussein Y. Afeefy, Joel F. Liebman, and Stephen E. Stein
AC - William E. Acree, Jr., James S. Chickos
Quantity | Value | Units | Method | Reference | Comment |
---|---|---|---|---|---|
Tboil | 416.0 | K | N/A | Weast and Grasselli, 1989 | BS |
Tboil | 416. | K | N/A | Parrot, Hervien, et al., 1964 | Uncertainty assigned by TRC = 3. K; TRC |
Quantity | Value | Units | Method | Reference | Comment |
Tfus | 221.2 | K | N/A | Dreisbach, 1955 | Uncertainty assigned by TRC = 0.02 K; TRC |
Quantity | Value | Units | Method | Reference | Comment |
ΔvapH° | 47.72 ± 0.10 | kJ/mol | C | Laynez and Wadso, 1972 | ALS |
ΔvapH° | 47.7 ± 0.1 | kJ/mol | C | Laynez, Wadsö, et al., 1972 | AC |
ΔvapH° | 38. | kJ/mol | E | Schjanberg, 1935 | ALS |
Enthalpy of vaporization
ΔvapH (kJ/mol) | Temperature (K) | Method | Reference | Comment |
---|---|---|---|---|
44.9 | 346. | A | Stephenson and Malanowski, 1987 | Based on data from 331. to 481. K. See also Dykyj, 1970.; AC |
47.2 | 291. | N/A | Stull, 1947 | Based on data from 276. to 416. K.; AC |
Antoine Equation Parameters
log10(P) = A − (B / (T + C))
P = vapor pressure (bar)
T = temperature (K)
View plot Requires a JavaScript / HTML 5 canvas capable browser.
Temperature (K) | A | B | C | Reference | Comment |
---|---|---|---|---|---|
276.4 to 416. | 4.85558 | 1820.46 | -40.857 | Stull, 1947 | Coefficents calculated by NIST from author's data. |

Kovats' RI, non-polar column, isothermal

View large format table.

Column type Active phase Temperature (C) I Reference Comment
CapillarySE-30100.808.Haken and Korhonen, 1986N2; Column length: 25. m; Column diameter: 0.33 mm
CapillarySE-30120.791.Haken and Korhonen, 1986N2; Column length: 25. m; Column diameter: 0.33 mm
CapillarySE-30140.785.Haken and Korhonen, 1986N2; Column length: 25. m; Column diameter: 0.33 mm
CapillarySE-3080.821.Haken and Korhonen, 1986N2; Column length: 25. m; Column diameter: 0.33 mm
CapillarySE-30100.835.Haken, Madden, et al., 1983Column length: 25. m; Column diameter: 0.22 mm
CapillarySE-30140.792.Haken, Madden, et al., 1983Column length: 25. m; Column diameter: 0.22 mm
CapillarySE-30180.786.Haken, Madden, et al., 1983Column length: 25. m; Column diameter: 0.22 mm
CapillaryOV-10180.811.5Komárek, Hornová, et al., 1982N2; Column length: 15. m; Column diameter: 0.22 mm

Kovats' RI, polar column, isothermal

View large format table.

Column type Active phase Temperature (C) I Reference Comment
CapillaryOV-351120.1361.Haken and Korhonen, 1986N2; Column length: 25. m; Column diameter: 0.33 mm
CapillaryOV-351140.1387.Haken and Korhonen, 1986N2; Column length: 25. m; Column diameter: 0.33 mm
CapillaryOV-351160.1365.Haken and Korhonen, 1986N2; Column length: 25. m; Column diameter: 0.33 mm
CapillaryOV-351180.1362.Haken and Korhonen, 1986N2; Column length: 25. m; Column diameter: 0.33 mm
CapillaryOV-351200.1391.Haken and Korhonen, 1986N2; Column length: 25. m; Column diameter: 0.33 mm

Normal alkane RI, non-polar column, temperature ramp

View large format table.

Column type Active phase I Reference Comment
CapillaryHP-1810.Peters, de Leer, et al., 199425. m/0.2 mm/0.33 μm, He, 50. C @ 5. min, 8. K/min, 300. C @ 10. min

References

Smith, Bjellerup, et al., 1953
Smith, L.; Bjellerup, L.; Krook, S.; Westermark, H.,
Heats of combustion of organic chloro compounds determined by the "quartz wool" method,
Acta Chem. Scand., 1953, 7, 65. [all data]
Schjanberg, 1935
Schjanberg, E.,
Die Verbrennungswarmen und die Refraktionsdaten einiger chlorsubstituierter Fettsauren und Ester.,
Z. Phys. Chem. Abt. A, 1935, 172, 197-233. [all data]
Weast and Grasselli, 1989
CRC Handbook of Data on Organic Compounds, 2nd Editon, Weast,R.C and Grasselli, J.G., ed(s)., CRC Press, Inc., Boca Raton, FL, 1989, 1. [all data]
Parrot, Hervien, et al., 1964
Parrot, J.; Hervien, J.; Ursy, Y.; Paty, M.,
Preparation and Properties of the N-(chloro and bromoacetyl)-piperdines,
Bull. Soc. Chim. Fr., 1964, 1964, 1063-9. [all data]
Dreisbach, 1955
Dreisbach, R.R.,
Physical Properties of Chemical Compounds, Advances in Chemistry Series No. 15, Am. Chem. Soc.: Washington, D. C., 1955. [all data]
Laynez and Wadso, 1972
Laynez, J.; Wadso, I.,
Enthalpies of vaporization of organic compounds. IX. Some halogen substituted hydrocarbons and esters,
Acta Chem. Scand., 1972, 26, 3148. [all data]
Laynez, Wadsö, et al., 1972
Laynez, José; Wadsö, Ingemar; Haug, Arne; Songstad, J.; Pilotti, Åke,
Enthalpies of Vaporization of Organic Compounds. IX. Some Halogen Substituted Hydrocarbons and Esters.,
Acta Chem. Scand., 1972, 26, 3148-3152, https://doi.org/10.3891/acta.chem.scand.26-3148
. [all data]
Stephenson and Malanowski, 1987
Stephenson, Richard M.; Malanowski, Stanislaw,
Handbook of the Thermodynamics of Organic Compounds, 1987, https://doi.org/10.1007/978-94-009-3173-2
. [all data]
Dykyj, 1970
Dykyj, J.,
Petrochemica, 1970, 10, 2, 51. [all data]
Stull, 1947
Stull, Daniel R.,
Vapor Pressure of Pure Substances. Organic and Inorganic Compounds,
Ind. Eng. Chem., 1947, 39, 4, 517-540, https://doi.org/10.1021/ie50448a022
. [all data]