Butanoic acid, 2-methyl-
- Formula: C5H10O2
- Molecular weight: 102.1317
- IUPAC Standard InChIKey: WLAMNBDJUVNPJU-UHFFFAOYSA-N
- CAS Registry Number: 116-53-0
- Chemical structure:
View 3d structure (requires JavaScript / HTML 5) - Species with the same structure:
- Stereoisomers:
- Other names: Butyric acid, 2-methyl-; α-Methylbutyric acid; Active valeric acid; Ethylmethylacetic acid; Methylethylacetic acid; 2-Methylbutanoic acid; 2-Methylbutyric acid; 2-Methybutyric acid; (.+/-.)-2-Methylbutanoic acid; DL-2-Methylbutyric acid; NSC 7304; 600-07-7

Gas phase thermochemistry data

Data compiled by: Donald R. Burgess, Jr.
Quantity | Value | Units | Method | Reference | Comment |
---|---|---|---|---|---|
ΔfH°gas | -495.4 ± 6.6 | kJ/mol | N/A | Hancock, Watson, et al., 1954 | Value computed using ΔfHliquid° value of -554.5±5.9 kj/mol from Hancock, Watson, et al., 1954 and ΔvapH° value of 59.1±3 kj/mol from sec-alkanoic correlation. |

Phase change data

Data compiled by: Thermodynamics Research Center, NIST Boulder Laboratories, Chris Muzny director
Quantity | Value | Units | Method | Reference | Comment |
---|---|---|---|---|---|
Tboil | 448. ± 4. | K | AVG | N/A | Average of 24 values; Individual data points |

Condensed phase thermochemistry data

Data compiled by: Hussein Y. Afeefy, Joel F. Liebman, and Stephen E. Stein
Quantity | Value | Units | Method | Reference | Comment |
---|---|---|---|---|---|
ΔfH°liquid | -132.5 ± 1.4 | kcal/mol | Ccb | Hancock, Watson, et al., 1954 | Reanalyzed by Cox and Pilcher, 1970, Original value = -133. kcal/mol |
Quantity | Value | Units | Method | Reference | Comment |
ΔcH°liquid | -679.3 ± 1.4 | kcal/mol | Ccb | Hancock, Watson, et al., 1954 | Reanalyzed by Cox and Pilcher, 1970, Original value = -679. kcal/mol; Corresponding ΔfHºliquid = -132.53 kcal/mol (simple calculation by NIST; no Washburn corrections) |

Gas phase ion energetics data

Data compiled by: Sharon G. Lias, Rhoda D. Levin, and Sherif A. Kafafi
Appearance energy determinations
Ion | AE (eV) | Other Products | Method | Reference | Comment |
---|---|---|---|---|---|
C3H6O2+ | 10.27 | C2H4 | EI | Holmes and Lossing, 1980 |

Kovats' RI, non-polar column, custom temperature program

Column type | Active phase | I | Reference | Comment |
---|---|---|---|---|
Capillary | HP-5MS | 894. | Alissandrakis E., Tarantilis P.A., et al., 2007 | 30. m/0.25 mm/0.25 μm, He; Program: 40C(3min) => 3C/min => 160C => 10C/min => 200C |

Kovats' RI, polar column, custom temperature program

Column type | Active phase | I | Reference | Comment |
---|---|---|---|---|
Capillary | Carbowax 20M | 1674. | Garruti, Franco, et al., 2001 | H2; Column length: 30. m; Column diameter: 0.25 mm; Program: 50 0C (8 min) 4 K/min -> 110 0C 16 K/min -> 200 0C |

Van Den Dool and Kratz RI, non-polar column, temperature ramp

Column type | Active phase | I | Reference | Comment |
---|---|---|---|---|
Capillary | SPB-5 | 850. | Engel and Ratel, 2007 | 60. m/0.32 mm/1. μm, 40. C @ 2. min, 3. K/min, 230. C @ 10. min |
Capillary | HP-5 | 846. | Quijano, Salamanca, et al., 2007 | 30. m/0.25 mm/0.25 μm, He, 50. C @ 4. min, 4. K/min, 250. C @ 10. min |
Capillary | DB-5 | 867. | Scheidig, Czerny, et al., 2007 | 30. m/0.32 mm/0.24 μm, He, 40. C @ 2. min, 6. K/min, 240. C @ 10. min |
Capillary | SE-54 | 875. | Schlutt B., Moran N., et al., 2007 | He, 40. C @ 2. min, 8. K/min, 240. C @ 5. min; Column length: 50. m; Column diameter: 0.32 mm |
Capillary | DB-5 | 873. | Steinhaus and Schieberle, 2007 | 30. m/0.32 mm/0.25 μm, 40. C @ 2. min, 6. K/min, 240. C @ 10. min |
Capillary | HP-5MS | 846. | Pino, Mesa, et al., 2005 | 30. m/0.25 mm/0.25 μm, He, 60. C @ 2. min, 4. K/min, 250. C @ 20. min |
Capillary | CP-Sil 8CB-MS | 868. | Hierro, de la Hoz, et al., 2004 | 60. m/0.25 mm/0.25 μm, 40. C @ 2. min, 4. K/min, 280. C @ 5. min |
Capillary | DB-5MS | 876. | Karagül-Yüceer, Vlahovich, et al., 2003 | 30. m/0.25 mm/0.25 μm, He, 35. C @ 5. min, 10. K/min, 200. C @ 30. min |
Capillary | HP-5MS | 846. | Lalel, Singh, et al., 2003 | 60. m/0.25 mm/0.25 μm, He, 40. C @ 1. min, 3. K/min, 310. C @ 20. min |
Capillary | DB-5 | 872. | Karagül-Yüceer, Cadwallader, et al., 2002 | 30. m/0.32 mm/0.25 μm, 35. C @ 5. min, 10. K/min, 200. C @ 30. min |
Capillary | CP-Sil 8CB-MS | 838. | Bruna, Hierro, et al., 2001 | 60. m/0.25 mm/0.25 μm, 40. C @ 2. min, 4. K/min; Tend: 280. C |
Capillary | HP-5 | 856.2 | Siegmund, Derler, et al., 2001 | 30. m/0.25 mm/0.25 μm, He, 5.3 K/min, 280. C @ 5. min; Tstart: 35. C |
Capillary | SPB-5 | 848. | Verdier-Metz., Coulon, et al., 1998 | 60. m/0.32 mm/1. μm, He, 40. C @ 5. min, 3. K/min, 200. C @ 2. min |
Capillary | SPB-1 | 838. | Lee, DeMilo, et al., 1995 | 30. m/0.25 mm/0.25 μm, He, 50. C @ 5. min, 5. K/min; Tend: 250. C |
Capillary | RSL-150 | 866. | Sagrero-Nieves, de Pooter, et al., 1989 | 30. m/0.53 mm/1.2 μm, He, 3. K/min; Tstart: 30. C; Tend: 220. C |

Van Den Dool and Kratz RI, non-polar column, custom temperature program

Column type | Active phase | I | Reference | Comment |
---|---|---|---|---|
Capillary | HP-5MS | 886.2 | Andriamaharavo, 2014 | 30. m/0.25 mm/0.25 μm, He; Program: 60C (1 min) => 5 C/min => 210C => 10 C/min => 280C (15 min) |
Capillary | DB-5 | 878. | Escudero, Campo, et al., 2007 | Program: not specified |
Capillary | DB-5 | 878. | Campo, Ferreira, et al., 2005 | Program: not specified |
Capillary | SE-54 | 879. | Fritsch and Schieberle, 2005 | 30. m/0.32 mm/0.25 μm, He; Program: 35C(2min) => 40C/min => 50C(2min) => 6C/min => 180C => 20C/min => 230C(10min) |
Capillary | DB-5 | 876. | Wang, Finn, et al., 2005 | 30. m/0.32 mm/1. μm, He; Program: 40C(2min) => 5C/min => 100C => 4C/min => 230C (10min) |
Capillary | DB-5 | 870. | Wang, Finn, et al., 2005 | 30. m/0.32 mm/1. μm, He; Program: 40C(2min) => 5C/min => 100C => 4C/min => 230C (10min) |
Capillary | DB-5 | 857. | Klesk, Qian, et al., 2004 | 30. m/0.32 mm/1. μm, He; Program: 40C (2min) => 5C/min => 100C => 4C/min => 230C (10min) |
Capillary | DB-5 | 854. | Klesk and Qian, 2003 | 30. m/0.25 mm/0.25 μm, He; Program: 40C(2min) => 5C/min => 100C => 4C/min => 230C(10min) |
Capillary | DB-1 | 839. | Place, Imhof, et al., 2003 | 60. m/0.32 mm/1. μm, He; Program: 35C(5min) => 10C/min => 45C (5min) => 5C/min => 250C (10min) |
Capillary | DB-5 | 858. | Jezussek, Juliano, et al., 2002 | 30. m/0.32 mm/0.25 μm, He; Program: 40C(1min) => 40C/min => 50C(2min) => 6C/min => 240C |
Capillary | DB-1 | 842. | Eri, Khoo, et al., 2000 | 60. m/0.25 mm/0.25 μm, He; Program: -20C (5min) => 10C/min => 100C => 4C/min => 200C => 10C/min => 280C |
Capillary | SE-54 | 878. | Tairu, Hofmann, et al., 2000 | 30. m/0.32 mm/0.25 μm, He; Program: 35C (2min) => 40C/min => 60C (2min) => 6C/min => 180C (5min) => 10C/min => 230C (5min) |
Capillary | SE-54 | 880. | Zimmermann and Schieberle, 2000 | 30. m/0.25 mm/0.25 μm, He; Program: 35C(2min) => 40C/min => 60C => 6C/min => 180C 20C/min => 240C(10min) |
Capillary | SE-54 | 875. | Buettner and Schieberle, 1999 | 30. m/0.32 mm/0.25 μm, He; Program: 35C (2min) => 40C/min => 50C (2min) => 6C/min => 180C => 10C/min => 230C (10min) |
Capillary | SE-54 | 874. | Derail, Hofmann, et al., 1999 | 30. m/0.32 mm/0.25 μm, He; Program: 35C (2min) => 40C/min => 50C => 4C/min => 230C (10min) |
Capillary | SE-54 | 873. | Fickert and Schieberle, 1998 | 25. m/0.32 mm/0.5 μm, He; Program: 35C (2min) => 4C/min => 150C => 10C/min => 240C |
Capillary | SE-54 | 875. | Hinterholzer, Lemos, et al., 1998 | 30. m/0.32 mm/0.25 μm, He; Program: 35C(2min) => 40C/min => 50C(2min) => 6C/min => 180C => 10C/min => 230C(10 min) |
Capillary | SE-54 | 873. | Münch, Hofmann, et al., 1997 | 30. m/0.32 mm/0.25 μm, He; Program: 40C (2min) => 40C/min => 50C (2min) => 240C (10min) |

Van Den Dool and Kratz RI, polar column, temperature ramp

Column type | Active phase | I | Reference | Comment |
---|---|---|---|---|
Capillary | DB-FFAP | 1657. | Scheidig, Czerny, et al., 2007 | 30. m/0.32 mm/0.24 μm, He, 40. C @ 2. min, 6. K/min, 240. C @ 10. min |
Capillary | FFAP | 1660. | Schlutt B., Moran N., et al., 2007 | He, 40. C @ 2. min, 8. K/min, 240. C @ 5. min; Column length: 30. m; Column diameter: 0.32 mm |
Capillary | FFAP | 1648. | Steinhaus and Schieberle, 2007 | 30. m/0.32 mm/0.25 μm, 40. C @ 2. min, 6. K/min, 240. C @ 10. min |
Capillary | DB-Wax | 1687. | Lopez-Galilea I., Fournier N., et al., 2006 | 30. m/0.32 mm/0.5 μm, He, 5. K/min, 240. C @ 10. min; Tstart: 40. C |
Capillary | LM-120 | 1693. | Pinto, Guedes, et al., 2006 | 50. m/0.25 mm/0.5 μm, 3. K/min, 240. C @ 30. min; Tstart: 50. C |
Capillary | OV-351 | 1658. | Bonvehí, 2005 | 50. m/0.32 mm/0.2 μm, He, 5. K/min; Tstart: 60. C; Tend: 220. C |
Capillary | Stabilwax | 1682. | Fang and Qian, 2005 | 30. m/0.32 mm/1. μm, N2, 40. C @ 2. min, 4. K/min, 230. C @ 10. min |
Capillary | ZB-Wax | 1675. | Ledauphin, Saint-Clair, et al., 2004 | 30. m/0.25 mm/0.15 μm, He, 35. C @ 10. min, 1.8 K/min, 220. C @ 10. min |
Capillary | DB-Wax Etr | 1657. | Ménager, Jost, et al., 2004 | 30. m/0.25 mm/0.25 μm, He, 40. C @ 3. min, 3. K/min, 245. C @ 20. min |
Capillary | DB-Wax | 1655. | Varming, Petersen, et al., 2004 | 30. m/0.25 mm/0.25 μm, He, 40. C @ 10. min, 6. K/min, 240. C @ 25. min |
Capillary | OV-351 | 1639. | Bonvehi and Coll, 2003 | 50. m/0.32 mm/0.2 μm, He, 5. K/min; Tstart: 60. C; Tend: 220. C |
Capillary | DB-FFAP | 1660. | Karagül-Yüceer, Vlahovich, et al., 2003 | 30. m/0.25 mm/0.25 μm, He, 35. C @ 5. min, 10. K/min, 200. C @ 30. min |
Capillary | DB-Wax | 1667. | Valim, Rouseff, et al., 2003 | 30. m/0.32 mm/0.5 μm, 7. K/min, 240. C @ 5. min; Tstart: 40. C |
Capillary | DB-FFAP | 1661. | Karagül-Yüceer, Cadwallader, et al., 2002 | 30. m/0.25 mm/0.25 μm, 35. C @ 5. min, 10. K/min, 200. C @ 30. min |
Capillary | DB-FFAP | 1649. | Karagül-Yüceer, Cadwallader, et al., 2002 | 30. m/0.25 mm/0.25 μm, 35. C @ 5. min, 10. K/min, 200. C @ 30. min |
Capillary | DB-Wax | 1680.6 | Siegmund, Derler, et al., 2001 | 30. m/0.32 mm/0.5 μm, He, 1.1 K/min, 250. C @ 10. min; Tstart: 35. C |
Capillary | FFAP | 1687. | Stephan and Steinhart, 1999 | 60. m/0.25 mm/0.5 μm, 50. C @ 3. min, 5. K/min, 230. C @ 15. min |
Capillary | DB-Wax | 1652. | Shimoda, Peralta, et al., 1996 | 60. m/0.25 mm/0.25 μm, He, 3. K/min; Tstart: 50. C; Tend: 230. C |
Capillary | DB-Wax | 1668. | Iwaoka, Hagi, et al., 1994 | He, 40. C @ 5. min, 2. K/min; Column length: 30. m; Column diameter: 0.25 mm; Tend: 200. C |
Capillary | DB-Wax | 1666. | Umano, Hagi, et al., 1992 | He, 40. C @ 10. min, 2. K/min; Column length: 30. m; Column diameter: 0.25 mm; Tend: 200. C |
Capillary | DB-Wax | 1641. | Humpf and Schreier, 1991 | 30. m/0.25 mm/0.25 μm, He, 50. C @ 3. min, 4. K/min, 220. C @ 20. min |
Capillary | DB-Wax | 1649. | Krammer, Winterhalter, et al., 1991 | 30. m/0.25 mm/0.25 μm, He, 50. C @ 3. min, 4. K/min; Tend: 240. C |
Capillary | Carbowax 20M | 1643. | Schwab, Mahr, et al., 1989 | 30. m/0.25 mm/0.25 μm, He, 40. C @ 3. min, 4. K/min; Tend: 240. C |

Van Den Dool and Kratz RI, polar column, custom temperature program

Column type | Active phase | I | Reference | Comment |
---|---|---|---|---|
Capillary | DB-Wax | 1682. | Escudero, Campo, et al., 2007 | 30. m/0.32 mm/0.5 μm, H2; Program: 40C(5min) => 4C/min => 100C6C/min => 136C => 3C/min => 220C (10min) |
Capillary | FFAP | 1660. | Frauendorfer and Schieberle, 2006 | 25. m/0.32 mm/0.2 μm, He; Program: 40C(1min) => 40C/min => 60C(1min) => 6C/min => 180C => 15C/min => 240C |
Capillary | DB-Wax | 1683. | Campo, Ferreira, et al., 2005 | 30. m/0.32 mm/0.5 μm, H2; Program: 40C(5min) => 4C/min => 100C => 6C/min => 200C |
Capillary | FFAP | 1671. | Fritsch and Schieberle, 2005 | 30. m/0.32 mm/0.25 μm, He; Program: 35C(2min) => 40C/min => 60C(2min) => 6C/min => 180C => 20C/min => 230C(10min) |
Capillary | Stabilwax | 1700. | Wang, Finn, et al., 2005 | 30. m/0.32 mm/1. μm, He; Program: 40C(2min) => 5C/min => 100C => 4C/min => 230C (10min) |
Capillary | Stabilwax | 1706. | Wang, Finn, et al., 2005 | 30. m/0.32 mm/1. μm, He; Program: 40C(2min) => 5C/min => 100C => 4C/min => 230C (10min) |
Capillary | DB-Wax | 1662. | Ferrari, Lablanquie, et al., 2004 | 60. m/0.25 mm/0.25 μm, He; Program: 35C(0.7min) => 20C/min => 70C => 4C/min => 240C |
Capillary | Stabilwax | 1703. | Klesk, Qian, et al., 2004 | 30. m/0.32 mm/1. μm, He; Program: 40C (2min) => 5C/min => 100C => 4C/min => 230C (10min) |
Capillary | DB-Wax | 1686. | Selli, Cabaroglu, et al., 2004 | 30. m/0.32 mm/0.5 μm, H2; Program: 60C(3min) => 2C/min => 220C => 3C/min => 245C (20min) |
Capillary | Carbowax 20M | 1705. | Boido, Lloret, et al., 2003 | 25. m/0.32 mm/0.25 μm, H2; Program: 40C (8min) => 3C/min => 180C => 20C/min => 230C |
Capillary | Stabilwax | 1693. | Klesk and Qian, 2003 | 30. m/0.32 mm/1. μm, He; Program: 40C(2min) => 5C/min => 100C => 4C/min => 230C(10min) |
Capillary | FFAP | 1660. | Jezussek, Juliano, et al., 2002 | 30. m/0.25 mm/0.25 μm, He; Program: 40C(1min) => 40C/min => 50C(2min) => 6C/min => 240C |
Capillary | FFAP | 1659. | Kirchhoff and Schieberle, 2002 | 30. m/0.32 mm/0.25 μm, He; Program: 35C (2min) => 60C/min => 50C (2min) => 6C/min => 240C (10min) |
Capillary | FFAP | 1659. | Kirchhoff and Schieberle, 2002 | 30. m/0.32 mm/0.25 μm, He; Program: 35C (2min) => 60C/min => 50C (2min) => 6C/min => 240C (10min) |
Capillary | FFAP | 1659. | Kirchhoff and Schieberle, 2001 | 30. m/0.32 mm/0.25 μm, He; Program: 40C(2min) => 40C/min => 60C(2min) => 6C/min => 240C(10min) |
Capillary | DB-FFAP | 1662. | Rychlik and Bosset, 2001 | 30. m/0.32 mm/0.25 μm, He; Program: 35C(2min) => 40C/min => 60C (2min) => 5C/min => 240C |
Capillary | FFAP | 1653. | Tairu, Hofmann, et al., 2000 | 30. m/0.32 mm/0.25 μm, He; Program: 35C (2min) => 40C/min => 60C (2min) => 6C/min => 180C (5min) => 10C/min => 230C (5min) |
Capillary | FFAP | 1676. | Zimmermann and Schieberle, 2000 | 30. m/0.25 mm/0.25 μm, He; Program: 35C(2min) => 40C/min => 60C => 6C/min => 180C 20C/min => 240C(10min) |
Capillary | FFAP | 1660. | Buettner and Schieberle, 1999 | 30. m/0.32 mm/0.25 μm, He; Program: 35C (2min) => 40C/min => 60C (2min) => 6C/min => 180C => 10C/min => 230C (10min) |
Capillary | FFAP | 1655. | Derail, Hofmann, et al., 1999 | 30. m/0.32 mm/0.25 μm, He; Program: 35C (2min) => 40C/min => 60C => 4C/min => 230C (10min) |
Capillary | FFAP | 1638. | Derail, Hofmann, et al., 1999 | 30. m/0.32 mm/0.25 μm, He; Program: 35C (2min) => 40C/min => 60C => 4C/min => 230C (10min) |
Capillary | FFAP | 1645. | Jagella and Grosch, 1999 | 30. m/0.32 mm/0.25 μm, He; Program: 40C(1min) => 40C/min => 60C => 6C/min => 230C |
Capillary | FFAP | 1666. | Fickert and Schieberle, 1998 | 25. m/0.32 mm/0.5 μm, He; Program: 35C (2min) => 40C/min => 60C => 6C/min => 230C (10min) |
Capillary | FFAP | 1660. | Hinterholzer, Lemos, et al., 1998 | 30. m/0.32 mm/0.25 μm, He; Program: 35C(2min) => 40C/min => 60C(2min) => 6C/min => 180C => 10C/min => 230C(10 min) |
Capillary | FFAP | 1651. | Münch, Hofmann, et al., 1997 | 30. m/0.32 mm/0.25 μm, He; Program: 40C (2min) => 40C/min => 60C (2min) => 240C (10min) |

Normal alkane RI, non-polar column, temperature ramp

Column type | Active phase | I | Reference | Comment |
---|---|---|---|---|
Capillary | VF-5 MS | 875. | Leffingwell and Alford, 2011 | 60. m/0.32 mm/0.25 μm, Helium, 2. K/min, 260. C @ 28. min; Tstart: 30. C |
Capillary | VF-5 MS | 879. | Leffingwell and Alford, 2011 | 60. m/0.32 mm/0.25 μm, Helium, 2. K/min, 260. C @ 28. min; Tstart: 30. C |
Capillary | HP-5 MS | 862. | Pino, Marquez, et al., 2010 | 30. m/0.32 mm/0.25 μm, Helium, 50. C @ 2. min, 4. K/min, 240. C @ 10. min |
Capillary | HP-5 MS | 832. | Radulovic, Blagojevic, et al., 2010 | 30. m/0.25 mm/0.25 μm, Helium, 5. K/min, 290. C @ 10. min; Tstart: 70. C |
Capillary | HP-5 MS | 859. | Kim and Chung, 2009 | 30. m/0.25 mm/0.25 μm, Helium, 35. C @ 5. min, 2. K/min, 195. C @ 30. min |
Capillary | SE-54 | 875. | Laselan, Buettner, et al., 2009 | 30. m/0.32 mm/0.25 μm, 0. C @ 2. min, 6. K/min; Tend: 200. C |
Capillary | HP-5 MS | 832. | Radulovic, Blagojevic, et al., 2009 | 30. m/0.25 mm/0.25 μm, Helium, 5. K/min, 290. C @ 10. min; Tstart: 70. C |
Capillary | HP-101 | 890. | Blazevic and Mastelic, 2008 | 25. m/0.20 mm/0.25 μm, Helium, 70. C @ 2. min, 3. K/min; Tend: 200. C |
Capillary | HP-101 | 890. | Blazevic and Mastelic, 2008 | 25. m/0.20 mm/0.25 μm, Helium, 70. C @ 2. min, 3. K/min; Tend: 200. C |
Capillary | 5 % Phenyl methyl siloxane | 839. | Ramirez R. and Cava R., 2007 | 30. m/0.25 mm/1. μm, He, 40. C @ 10. min, 7. K/min, 250. C @ 5. min |
Capillary | 5 % Phenyl methyl siloxane | 839. | Ramirez R. and Cava R., 2007 | 30. m/0.25 mm/1. μm, He, 40. C @ 10. min, 7. K/min, 250. C @ 5. min |
Capillary | DB-5 | 858. | Zeller and Rychlik, 2007 | 25. m/0.32 mm/0.25 μm, He, 40. C @ 1. min, 6. K/min; Tend: 230. C |
Capillary | SPB-5 | 841. | Pino, Marquez, et al., 2006 | 30. m/0.25 mm/0.25 μm, Helium, 60. C @ 2. min, 4. K/min, 250. C @ 20. min |
Capillary | BPX5 | 842. | Boustie, Rapior, et al., 2005 | 25. m/0.20 mm/0.13 μm, He, 50. C @ 2. min, 3. K/min; Tend: 230. C |
Capillary | HP-5 | 898.3 | Leffingwell and Alford, 2005 | 60. m/0.32 mm/0.25 μm, He, 30. C @ 2. min, 2. K/min, 260. C @ 28. min |
Capillary | MDN-5 | 888. | van Loon, Linssen, et al., 2005 | 60. m/0.25 mm/0.25 μm, He, 40. C @ 4. min, 4. K/min, 270. C @ 5. min |
Capillary | MDN-5 | 855. | van Loon, Linssen, et al., 2005 | 60. m/0.25 mm/0.25 μm, He, 40. C @ 4. min, 4. K/min, 270. C @ 5. min |
Capillary | SPB-5 | 826. | Pino, Marbot, et al., 2005 | 30. m/0.25 mm/0.25 μm, He, 60. C @ 2. min, 4. K/min, 250. C @ 20. min |
Capillary | DB-1 | 818. | Velasco-Negueruela, Pérez-Alonso, et al., 2005 | 50. m/0.25 mm/0.25 μm, N2, 4. K/min; Tstart: 90. C; Tend: 240. C |
Capillary | SE-54 | 820. | Kilic, Hafizoglu, et al., 2004 | 30. m/0.053 mm/1.5 μm, He, 5. K/min; Tstart: 100. C; Tend: 250. C |
Capillary | SPB-5 | 839. | Sebastian, Viallon-Fernandez, et al., 2003 | 60. m/0.32 mm/1.0 μm, Helium, 3. K/min; Tstart: 30. C; Tend: 230. C |
Capillary | DB-1 | 818. | Velasco-Negueruela, Pérez-Alonso, et al., 2002 | 50. m/0.25 mm/0.25 μm, N2, 4. K/min; Tstart: 95. C; Tend: 240. C |
Capillary | DB-5MS | 837. | Cadwallader and Heo, 2001 | 30. m/0.53 mm/1.5 μm, He, 40. C @ 5. min, 6. K/min, 225. C @ 30. min |
Capillary | RSL-200 | 836. | Ngassoum, Jirovetz, et al., 2001 | 30. m/0.32 mm/0.25 μm, H2, 40. C @ 5. min, 6. K/min, 280. C @ 5. min |
Capillary | DB-5 | 844. | Czerny and Grosch, 2000 | 30. m/0.32 mm/0.25 μm, He, 40. C @ 2. min, 6. K/min, 230. C @ 5. min |
Capillary | HP-5 | 848. | García, Martín, et al., 2000 | 60. m/0.32 mm/1. μm, He, 3. K/min; Tstart: 40. C; Tend: 240. C |
Capillary | DB-5 | 868. | Kotseridis and Baumes, 2000 | 30. m/0.32 mm/0.5 μm, H2, 60. C @ 3. min, 3. K/min, 245. C @ 20. min |
Capillary | DB-5 | 868. | Kotseridis and Baumes, 2000 | 30. m/0.32 mm/0.5 μm, H2, 60. C @ 3. min, 3. K/min, 245. C @ 20. min |
Capillary | SPB-5 | 830. | Doneanu and Anitescu, 1998 | 50. m/0.32 mm/0.25 μm, He, 3. K/min, 240. C @ 20. min; Tstart: 60. C |
Capillary | Optima 1 | 861. | Fons, Rapior, et al., 1998 | 25. m/0.20 mm/0.25 μm, Helium, 3. K/min; Tstart: 50. C; Tend: 200. C |
Capillary | HP-1 | 846. | Ong, Acree, et al., 1998 | 4. K/min; Column length: 25. m; Column diameter: 0.32 mm; Tstart: 35. C; Tend: 250. C |
Capillary | DB-5 | 843. | Kondjoyan, Viallon, et al., 1997 | 60. m/0.32 mm/1. μm, 40. C @ 5. min, 3. K/min, 200. C @ 2. min |
Capillary | DB-5 | 853. | Kondjoyan, Viallon, et al., 1997 | 60. m/0.32 mm/1. μm, 40. C @ 5. min, 3. K/min, 200. C @ 2. min |
Capillary | DB-1 | 813. | Robacker and Bartelt, 1997 | 30. m/0.32 mm/0.5 μm, He, 35. C @ 1. min, 10. K/min; Tend: 200. C |
Capillary | DB-1 | 842. | Binder, Benson, et al., 1990 | 4. K/min, 230. C @ 10. min; Column length: 60. m; Column diameter: 0.32 mm; Tstart: 50. C |
Capillary | DB-1 | 829. | Binder, Turner, et al., 1990 | 4. K/min, 230. C @ 10. min; Column length: 60. m; Column diameter: 0.32 mm; Tstart: 50. C |
Capillary | DB5-30W | 863. | Schwab and Schreier, 1988 | 30. m/0.25 mm/0.25 μm, He, 5. K/min; Tstart: 60. C; Tend: 300. C |
Capillary | DB-1 | 896. | Habu, Flath, et al., 1985 | 3. K/min; Column length: 50. m; Column diameter: 0.32 mm; Tstart: 0. C; Tend: 250. C |

Normal alkane RI, non-polar column, custom temperature program

Column type | Active phase | I | Reference | Comment |
---|---|---|---|---|
Capillary | Siloxane, 5 % Ph | 837. | VOC BinBase, 2012 | Program: not specified |
Capillary | HP-5 MS | 850. | Nance and Setzer, 2011 | 30. m/0.25 mm/0.25 μm, Helium; Program: 40 0C (10 min) 3 0C/min -> 200 0C 2 0C/min -> 220 0C |
Capillary | Polydimethyl siloxane, 5 % phenyl | 837. | Skogerson, Wohlgemuth, et al., 2011 | Program: not specified |
Capillary | HP-5 MS | 860. | Pino, Marquez, et al., 2010 | 30. m/0.32 mm/0.25 μm, Helium; Program: not specified |
Capillary | DB-5 | 898. | San-Juan, Petka, et al., 2010 | 30. m/0.32 mm/0.50 μm, Hydrogen; Program: 40 0C (5 min) 4 0C/min -> 100 0C 6 0C/min -> 220 0C (20 min) |
Capillary | SE-54 | 875. | Christlbauer and Schieberle, 2009 | 30. m/0.32 mm/0.25 μm, Helium; Program: 35 0C (2 min) 10 0C/min -> 50 0C (2 min) 6 0C/min -> 250 0C |
Capillary | HP-5 | 850. | Pugliese, Sirtori, et al., 2009 | 50. m/0.32 mm/1.05 μm, Helium; Program: not specified |
Capillary | CP-Sil 5 Cb | 818. | Collin, Nizet, et al., 2008 | 50. m/0.32 mm/1.20 μm, Nitrogen; Program: 40 0C 20 0C/min -> 85 0C 1 0C/min -> 145 0C 3 0C/min -> 250 0C (30 min) |
Capillary | HP-5 | 881. | Zhao, Li, et al., 2008 | 30. m/0.25 mm/0.25 μm; Program: 40 0C (2 min) 5 0C/min -> 80 0C 7 oC/min -> 160 0C 9 0C/min -> 200 0C 20 0C/min -> 280 0C (10 min) |
Capillary | DB-5 | 875. | Buettner, 2007 | 30. m/0.32 mm/0.25 μm; Program: 40C(2min) => 40C/min => 60C(2min) => 6C/min => 180C => 15C/min => 230C(10min) |
Capillary | DB-5 | 878. | Greger and Schieberle, 2007 | 30. m/0.25 mm/0.25 μm, He; Program: 40C(1min) => 7C/min => 110C => 5C/min => 180C => 10C/min => 240C(10min) |
Capillary | SE-54 | 875. | Lasekan, Buettner, et al., 2007 | 30. m/0.32 mm/0.25 μm; Program: 35C(2min) => 40C/min => 60C(2min) => 6C/min => 180C => 10C/min => 230C(10min) |
Capillary | HP-5MS | 894. | Alissandrakis, Kibaris, et al., 2005 | 30. m/0.25 mm/0.25 μm, He; Program: 40C(3min) => 2C/min => 180C => 10C/min => 250C(5min) |
Capillary | SE-54 | 875. | Buettner, 2004 | 30. m/0.32 mm/0.25 μm, He; Program: 40C(2min) => 40C/min => 50C(2min) => 6C/min => 180C => 15C/min => 230C (10min) |
Capillary | SE-54 | 875. | Buettner, 2004 | 30. m/0.32 mm/0.25 μm, He; Program: 40C(2min) => 40C/min => 50C(2min) => 6C/min => 180C => 15C/min => 230C (10min) |
Capillary | CP Sil 5 CB | 815. | Counet, Ouwerx, et al., 2004 | 50. m/0.32 mm/1.2 μm; Program: 36C => 20C/min => 85C => 1C/min => 145C => 3C/min => 250C(30min) |
Capillary | HP-5 | 851. | Garcia-Estaban, Ansorena, et al., 2004 | 50. m/0.32 mm/1.05 μm; Program: 40C(10min) => 5C/min => 200C => 20C/min => 250C(5min) |
Capillary | DB-5 | 851. | Garcia-Estaban, Ansorena, et al., 2004, 2 | 50. m/0.32 mm/1.05 μm; Program: 40C(10min) => 5C/min => 200C => 20C/min => 250C (5min) |
Capillary | SPB-5 | 843. | Begnaud, Pérès, et al., 2003 | 60. m/0.32 mm/1. μm; Program: not specified |
Capillary | BPX-5 | 884. | Machiels, van Ruth, et al., 2003 | 60. m/0.32 mm/1. μm, He; Program: 40C (4min) => 2C/min => 90C => 4C/min => 130C => 8C/min => 250 C (10min) |
Capillary | DB-5MS | 847. | Young, Lane, et al., 2003 | 30. m/0.25 mm/1. μm; Program: 50C => 3C/min => 160C => 6C/min => 250C => 25C/min => 325C |
Capillary | DB-5 | 869. | Bücking and Steinhart, 2002 | 30. m/0.53 mm/1.5 μm; Program: -5C(1min) => 4C/min => 50C => 6C/min => 120C => 8C/min => 250C(2min) |
Capillary | SPB-5 | 844. | Lee and Kim, 2002 | 60. m/0.25 mm/0.25 μm, Helium; Program: 50 0C (3 min) 4 0C/min -> 200 0C 8 0C/min -> 240 0C (5 min) |
Capillary | DB-5 | 891. | Rapior, Breheret, et al., 2002 | 30. m/0.20 mm/1.0 μm; Program: not specified |
Capillary | DB-5 | 891. | Rapior, Breheret, et al., 2002 | 30. m/0.20 mm/1.0 μm; Program: not specified |
Capillary | HP-5MS | 881. | Ansorena, Gimeno, et al., 2001 | 30. m/0.25 mm/0.25 μm, He; Program: 40C (10min) => 3C/min => 120C => 10C/min => 250C (5min) |
Capillary | HP-1 | 830. | Teai, Claude-Lafontaine, et al., 2001 | 50. m/0.32 mm/0.52 μm, N2; Program: 40C => 2C/min => 130C => 4C/min => 250C |
Capillary | HP-5 | 858. | Ansorena, Astiasarán, et al., 2000 | 30. m/0.25 mm/0.25 μm, He; Program: 40C (10min) => 3C/min => 120C => 10C/min => 250C (5min) |
Capillary | CP Sil 5 CB | 819. | Guyot, Scheirman, et al., 1999 | He; Column length: 50. m; Column diameter: 0.32 mm; Program: 30C => 55C/min => 85C => 1C/min => 145C => 3C/min => 250C |
Capillary | CP Sil 5 CB | 818. | Guyot, Bouseta, et al., 1998 | 50. m/0.32 mm/1.2 μm, He; Program: 30C => 55C/min => 85C => 1C/min => 145C => 3C/min => 250C |
Capillary | HP-5 | 839. | Timón, Ventanas, et al., 1998 | 50. m/0.32 mm/0.52 μm, He; Program: 35 0C 10 0C/min -> 200 0C (20 min) 5 0C/min -> 230 0C (50 min) |
Capillary | DB-5 | 861. | Mateo, Aguirrezábal, et al., 1997 | 50. m/0.32 mm/0.25 μm, He; Program: 40C(10min) => 3C/min => 95C => 10C/min => 270C(10min) |
Capillary | SE-54 | 873. | Schermann and Schieberle, 1997 | 30. m/0.32 mm/0.25 μm, He; Program: 35C (2min) => 40C/min => 60C (2min) => 6C/min => 180C => 10C/min => 240C |
Capillary | DB-5 | 860. | Mateo and Zumalacárregui, 1996 | 50. m/0.32 mm/0.25 μm, He; Program: 40C (10min) => 3C/min => 95C => 10C/min => 270C (10min) |
Capillary | DB-5 | 860. | Mateo and Zumalacárregui, 1996 | 50. m/0.32 mm/0.25 μm, He; Program: 40C (10min) => 3C/min => 95C => 10C/min => 270C (10min) |
Capillary | SE-54 | 860. | Blank, Sen, et al., 1992 | Program: not specified |

Normal alkane RI, polar column, temperature ramp

Column type | Active phase | I | Reference | Comment |
---|---|---|---|---|
Capillary | VF-Wax MS | 1667. | Duarte, Dias, et al., 2010 | 60. m/0.25 mm/0.25 μm, Helium, 60. C @ 5. min, 3. K/min, 220. C @ 25. min |
Capillary | TC-Wax | 1691. | Miyazawa, Fujita, et al., 2010 | Helium, 40. C @ 3. min, 3. K/min; Column length: 60. m; Column diameter: 0.25 mm; Tend: 230. C |
Capillary | FFAP | 1662. | Christlbauer and Schieberle, 2009 | 30. m/0.32 mm/0.25 μm, Helium, 40. C @ 2. min, 6. K/min; Tend: 240. C |
Capillary | DB-FFAP | 1656. | Laselan, Buettner, et al., 2009 | 30. m/0.32 mm/0.25 μm, 0. C @ 2. min, 6. K/min; Tend: 200. C |
Capillary | CP-Wax 52CB | 1668. | Audino, Alzogaray, et al., 2007 | He, 50. C @ 2. min, 6. K/min, 220. C @ 20. min; Column length: 30. m; Phase thickness: 0.32 μm |
Capillary | DB-Wax | 1659. | Xu, Fan, et al., 2007 | 30. m/0.25 mm/0.25 μm, He, 40. C @ 2. min, 4. K/min, 230. C @ 5. min |
Capillary | DB-FFAP | 1660. | Zeller and Rychlik, 2007 | 30. m/0.32 mm/0.25 μm, He, 40. C @ 1. min, 6. K/min; Tend: 230. C |
Capillary | DB-Wax | 1659. | Fan and Qian, 2006 | 30. m/0.32 mm/0.25 μm, He, 40. C @ 2. min, 4. K/min, 230. C @ 15. min |
Capillary | DB-Wax | 1688. | Qian and Wang, 2005 | 60. m/0.32 mm/0.50 μm, Nitrogen, 35. C @ 4. min, 2. K/min, 235. C @ 30. min |
Capillary | HP-Innowax | 1658. | Wijaya, Ulrich, et al., 2005 | 15. m/0.25 mm/1. μm, 45. C @ 5. min, 10. K/min, 210. C @ 5. min |
Capillary | DB-Wax | 1670. | Dregus and Engel, 2003 | 60. m/0.32 mm/0.25 μm, H2, 40. C @ 5. min, 4. K/min, 230. C @ 25. min |
Capillary | DB-Wax | 1660. | Lee and Noble, 2003 | 30. m/0.25 mm/0.25 μm, He, 40. C @ 4. min, 4. K/min, 185. C @ 20. min |
Capillary | DB-Wax | 1688. | López, Ortín, et al., 2003 | 30. m/0.32 mm/0.5 μm, H2, 40. C @ 5. min, 4. K/min; Tend: 200. C |
Capillary | DB-FFAP | 1652. | Czerny and Schieberle, 2002 | 30. m/0.32 mm/0.25 μm, He, 40. C @ 2. min, 6. K/min, 230. C @ 10. min |
Capillary | DB-FFAP | 1652. | Czerny and Schieberle, 2002 | 30. m/0.32 mm/0.25 μm, He, 40. C @ 2. min, 6. K/min, 230. C @ 10. min |
Capillary | DB-Wax | 1674. | Ito, Sugimoto, et al., 2002 | 60. C @ 4. min, 3. K/min; Column length: 60. m; Column diameter: 0.25 mm; Tend: 180. C |
Capillary | DB-FFAP | 1654. | Sanz, Czerny, et al., 2002 | 30. m/0.32 mm/0.25 μm, He, 40. C @ 2. min, 6. K/min, 230. C @ 5. min |
Capillary | TC-Wax | 1644. | Suhardi, Suzuki, et al., 2002 | 60. m/0.25 mm/0.25 μm, He, 40. C @ 10. min, 3. K/min, 230. C @ 10. min |
Capillary | DB-Wax | 1664. | Umano, Hagi, et al., 2002 | 60. m/0.25 mm/0.25 μm, He, 40. C @ 2. min, 2. K/min; Tend: 200. C |
Capillary | DB-Wax | 1662. | Cadwallader and Heo, 2001 | 30. m/0.53 mm/1. μm, He, 40. C @ 5. min, 6. K/min, 225. C @ 30. min |
Capillary | FFAP | 1671. | Ducruet, Fournier, et al., 2001 | 30. m/0.32 mm/0.25 μm, H2, 40. C @ 5. min, 3. K/min; Tend: 240. C |
Capillary | DB-Wax | 1620. | Weckerle, Bastl-Borrmann, et al., 2001 | 30. m/0.25 mm/0.25 μm, He, 50. C @ 3. min, 4. K/min; Tend: 220. C |
Capillary | FFAP | 1657. | Czerny and Grosch, 2000 | 30. m/0.32 mm/0.25 μm, He, 40. C @ 2. min, 6. K/min, 230. C @ 5. min |
Capillary | DB-Wax | 1661. | Kotseridis and Baumes, 2000 | 30. m/0.32 mm/0.5 μm, H2, 60. C @ 3. min, 3. K/min, 245. C @ 20. min |
Capillary | DB-Wax | 1661. | Kotseridis and Baumes, 2000 | 30. m/0.32 mm/0.5 μm, H2, 60. C @ 3. min, 3. K/min, 245. C @ 20. min |
Capillary | DB-Wax | 1639. | Parada, Duque, et al., 2000 | 30. m/0.25 mm/0.25 μm, He, 50. C @ 3. min, 4. K/min, 240. C @ 10. min |
Capillary | DB-Wax | 1641. | Parada, Duque, et al., 2000 | 30. m/0.25 mm/0.25 μm, He, 50. C @ 3. min, 4. K/min, 240. C @ 10. min |
Capillary | DB-Wax | 1670. | Buttery, Orts, et al., 1999 | 30. C @ 4. min, 2. K/min, 170. C @ 60. min; Column length: 60. m; Column diameter: 0.32 mm |
Capillary | DB-Wax | 1666. | Suriyaphan, Drake, et al., 1999 | 30. m/0.33 mm/0.25 μm, Helium, 40. C @ 5. min, 6. K/min, 200. C @ 30. min |
Capillary | HP-Innowax | 1665. | Ong, Acree, et al., 1998 | 4. K/min; Column length: 25. m; Column diameter: 0.32 mm; Tstart: 35. C; Tend: 250. C |
Capillary | DB-Wax | 1662. | Parada and Duque, 1998 | 30. m/0.25 mm/0.25 μm, He, 50. C @ 3. min, 4. K/min, 240. C @ 10. min |
Capillary | DB-Wax | 1666. | Parada and Duque, 1998 | 30. m/0.25 mm/0.25 μm, He, 50. C @ 3. min, 4. K/min, 240. C @ 10. min |
Capillary | DB-Wax | 1670. | Sekiwa, Kubota, et al., 1997 | He, 2. K/min; Column length: 60. m; Column diameter: 0.25 mm; Tstart: 60. C; Tend: 180. C |
Capillary | HP-Innowax | 1711. | Ulrich, Hoberg, et al., 1997 | 60. m/0.32 mm/0.5 μm, H2, 1.5 K/min; Tstart: 50. C; Tend: 180. C |
Capillary | DB-Wax | 1678. | Milo and Grosch, 1996 | 50. m/0.32 mm/1. μm, 20. C @ 2. min, 6. K/min; Tend: 230. C |
Capillary | TC-Wax | 1668. | Shuichi, Masazumi, et al., 1996 | 80. C @ 5. min, 3. K/min; Column length: 60. m; Column diameter: 0.25 mm; Tend: 240. C |
Capillary | Carbowax 20M | 1632. | Kawakami and Kobayashi, 1991 | He, 60. C @ 4. min, 2. K/min; Column length: 50. m; Column diameter: 0.25 mm; Tend: 180. C |
Capillary | Carbowax 20M | 1673. | Mihara, Tateba, et al., 1988 | N2, 3. K/min; Column length: 50. m; Column diameter: 0.22 mm; Tstart: 80. C; Tend: 200. C |
Capillary | Carbowax 20M | 1685. | Mihara, Tateba, et al., 1988 | N2, 3. K/min; Column length: 50. m; Column diameter: 0.22 mm; Tstart: 80. C; Tend: 200. C |
Capillary | DB-Wax | 1676. | Andersen J.F., Mikolajczak K.L., et al., 1987 | Helium, 40. C @ 1. min, 6. K/min; Column length: 30. m; Column diameter: 0.32 mm; Tend: 200. C |
Capillary | Carbowax 20M | 1673. | Mihara, Tateba, et al., 1987 | N2, 3. K/min; Column length: 50. m; Column diameter: 0.22 mm; Tstart: 80. C; Tend: 200. C |
Capillary | Carbowax 20M | 1685. | Mihara, Tateba, et al., 1987 | N2, 3. K/min; Column length: 50. m; Column diameter: 0.22 mm; Tstart: 80. C; Tend: 200. C |

Normal alkane RI, polar column, custom temperature program

Column type | Active phase | I | Reference | Comment |
---|---|---|---|---|
Capillary | DB-Wax | 1668. | Gyawali and Kim, 2012 | 60. m/0.20 mm/0.25 μm, Helium; Program: 40 0C (3 min) 2 0C/min -> 150 0C 4 0C/min -> 220 0C (20 min) 5 0C/min -> 230 0C |
Capillary | HP-FFAP | 1662. | Toontom, Meenune, et al., 2012 | 25. m/0.32 mm/0.50 μm, Helium; Program: 45 0C (2 min) 3 0C/min -> 130 0C (1 min) 20 0C/min -> 220 0C (3 min) 20 0C/min -> 230 0C (3 min) |
Capillary | SOLGel-Wax | 1677. | Johanningsmeier and McFeeters, 2011 | 30. m/0.25 mm/0.25 μm, Helium; Program: 40 0C (2 min) 5 0C/min -> 140 0C 10 0C/min -> 250 0C (3 min) |
Capillary | SOLGel-Wax | 1682. | Johanningsmeier and McFeeters, 2011 | 30. m/0.25 mm/0.25 μm, Helium; Program: not specified |
Capillary | DB-Wax | 1667. | Sampaio, Garruti, et al., 2011 | 30. m/0.25 mm/0.25 μm, Hydrogen; Program: 35 0C (9 min) 5 0C/min -> 80 0C 1 0C/min -> 100 0C 16 0C/min -> 210 0C (20 min) |
Capillary | DB-Wax | 1634. | Parker, Tsormpatsidis, et al., 2010 | Program: not specified |
Capillary | DB-Wax | 1675. | San-Juan, Petka, et al., 2010 | 30. m/0.32 mm/0.50 μm, Hydrogen; Program: 40 0C (5 min) 4 0C/min -> 100 0C 6 0C/min -> 220 0C (20 min) |
Capillary | DB-Wax | 1675. | Ferreira, Juan, et al., 2009 | 30. m/0.32 mm/0.50 μm; Program: 40 0C (5 min) 4 0C/min -> 100 0C 6 0C/min -> 220 0C (40 min) |
Capillary | DB-Wax | 1677. | Loscos, Hernandez-Orte, et al., 2009 | 60. m/0.25 mm/0.50 μm, Helium; Program: 40 0C (3 min) 10 0C/min -> 90 0C 2 0C/min -> 230 0C (37 min) |
Capillary | FFAP | 1646. | Frauendorfer and Schieberle, 2008 | Helium; Program: not specified |
Capillary | DB-FFAP | 1661. | Buettner, 2007 | 30. m/0.32 mm/0.25 μm; Program: 40C(2min) => 40C/min => 60C(2min) => 6C/min => 180C => 15C/min => 230C(10min) |
Capillary | DB-FFAP | 1662. | Greger and Schieberle, 2007 | 30. m/0.32 mm/0.25 μm, He; Program: 40C(1min) => 7C/min => 180C => 10C/min => 240C (10min) |
Capillary | DB-FFAP | 1661. | Lasekan, Buettner, et al., 2007 | 30. m/0.32 mm/0.25 μm; Program: 35C(2min) => 40C/min => 50C(2min) => 6C/min => 180C => 10C/min => 230C(10min) |
Capillary | DB-Wax Etr | 1677. | Loskos, Hernandez-Orte, et al., 2007 | 60. m/0.25 mm/0.5 μm, He; Program: 40C(3min) => 10C/min => 90C => 2C/min => 230C (37min) |
Capillary | DB-Wax | 1667. | Tian, Zhang, et al., 2007 | 30. m/0.25 mm/0.25 μm, He; Program: 50 0C (2 min) 6 0C/min -> 150 0C 8 0C/min -> 230 0C (15 min) |
Capillary | DB-Wax | 1671. | Krings, Zelena, et al., 2006 | 30. m/0.32 mm/0.25 μm, He; Program: 45C(5min) => 5C/min => 150C => 10C/min => 240C (10min) |
Capillary | DB-Wax | 1661. | Steinhaus and Schieberle, 2005 | 30. m/0.32 mm/0.25 μm, He; Program: 40 0C (2 min) 6 K/min -> 190 0C 12 K/min -> 240 0C |
Capillary | DB-FFAP | 1660. | Buettner, 2004 | 30. m/0.32 mm/0.25 μm, He; Program: 40C(2min) => 40C/min => 60C(2min) => 6C/min => 180C => 15C/min => 230C (10min) |
Capillary | DB-FFAP | 1661. | Buettner, 2004 | 30. m/0.32 mm/0.25 μm, He; Program: 40C(2min) => 40C/min => 60C(2min) => 6C/min => 180C => 15C/min => 230C (10min) |
Capillary | PEG-20M | 1674. | Garruti, Franco, et al., 2003 | 30. m/0.25 mm/0.25 μm; Program: 50C(8min) => 4C/min => 110C => 16C/min => 200C |
Capillary | FFAP | 1660. | Buettner and Schieberle, 2001 | 30. m/0.32 mm/0.25 μm, He; Program: 35C (2min) => 40C/min => 60C (2min) => 6C/min => 180C => 10C/min => 230C (10min) |
Capillary | DB-Wax | 1662. | Mayorga, Knapp, et al., 2001 | 30. m/0.25 mm/0.25 μm; Program: 50C(4min) => 4C/min => 130C => 1C/min => 190C => 4C/min => 220C(20min) |
Capillary | DB-Wax | 1665. | Mayorga, Knapp, et al., 2001 | 30. m/0.25 mm/0.25 μm; Program: 50C(4min) => 4C/min => 130C => 1C/min => 190C => 4C/min => 220C(20min) |
Capillary | Carbowax 20M | 1625. | Teai, Claude-Lafontaine, et al., 2001 | 50. m/0.2 mm/0.2 μm, N2; Program: 60C => 2C/min => 150C => 4C/min => 220C |
Capillary | CP-Wax 52CB | 1686. | Muresan, Eillebrecht, et al., 2000 | 50. m/0.32 mm/1.2 μm; Program: 40C(10min) => 3C/min => 190C => 10C/min => 250C(5min) |
Capillary | FFAP | 1668. | Reiners and Grosch, 1998 | 25. m/0.32 mm/0.3 μm; Program: 35C (2min) => 40C/min => 60C(1min) => 6C/min => 230C |
Capillary | FFAP | 1651. | Zehentbauer and Grosch, 1998 | 25. m/0.32 mm/0.25 μm, He; Program: 35C(2min) => 40C/min => 60C(2min) => 6C/min => 230C |
Capillary | DB-FFAP | 1657. | Guth, 1997 | 30. m/0.32 mm/0.25 μm; Program: 35C (1min) => 40C/min => 60C (1min) => 6C/min => 250C (10min) |
Capillary | FFAP | 1652. | Schermann and Schieberle, 1997 | 30. m/0.32 mm/0.25 μm, He; Program: 35C (2min) => 40C/min => 60C (2min) => 6C/min => 180C => 10C/min => 240C |
Capillary | FFAP | 1652. | Schermann and Schieberle, 1997 | 30. m/0.32 mm/0.25 μm, He; Program: 35C (2min) => 40C/min => 60C (2min) => 6C/min => 180C => 10C/min => 240C |
Capillary | FFAP | 1657. | Guth and Grosch, 1994 | Program: not specified |
Capillary | FFAP | 1665. | Schieberle and Grosch, 1994 | He; Column length: 30. m; Column diameter: 0.32 mm; Program: 35C => 40C/min => 60C(2min) => 4C/min => 240C |
Capillary | FFAP | 1657. | Guth and Grosch, 1993 | Program: not specified |

References

Hancock, Watson, et al., 1954
Hancock, C.K.; Watson, G.M.; Gilby, R.F.,
Heats of combustion of five-carbon fatty acids and their methyl and ethyl esters,
J. Phys. Chem., 1954, 58, 127-129. [all data]