Aldicarb
- Formula: C7H14N2O2S
- Molecular weight: 190.263
- IUPAC Standard InChIKey: QGLZXHRNAYXIBU-UHFFFAOYSA-N
- CAS Registry Number: 116-06-3
- Chemical structure:
View 3d structure (requires JavaScript / HTML 5) - Other names: Propanal, 2-methyl-2-(methylthio)-, O-[(methylamino)carbonyl]oxime; Propionaldehyde, 2-methyl-2-(methylthio)-, O-(methylcarbamoyl)oxime; Ambush; Temik; Temik G 10; 2-Methyl-2-(Methylthio)propionaldehyde O-(methylcarbamoyl)oxime; Aldecarb; Aldicarbe; Carbamic acid, methyl-, O-((2-methyl-2-(methylthio)propylidene)amino) deriv.; 2-Methyl-2-(methylthio)propanal, O-((methylamino)carbonyl)oxime; 2-Methyl-2-methylthio-propionaldehyd-O-(N-methyl-carbamoyl)-oxime; 2-Metil-2-tiometil-propionaldeid-O-(N-metil-carbamoil)-ossima; Temic; Temik 10 G; NSC 379586; OMS-771; UC-21149

Phase change data

Data compiled as indicated in comments:
TRC - Thermodynamics Research Center, NIST Boulder Laboratories, Chris Muzny director
AC - William E. Acree, Jr., James S. Chickos
Quantity | Value | Units | Method | Reference | Comment |
---|---|---|---|---|---|
Tfus | 374.42 | K | N/A | Donnelly, Drewes, et al., 1990 | Uncertainty assigned by TRC = 0.2 K; TRC |
Tfus | 374.2 | K | N/A | Plato and Glasgow, 1969 | Uncertainty assigned by TRC = 0.2 K; TRC |
Enthalpy of sublimation
ΔsubH (kJ/mol) | Temperature (K) | Method | Reference | Comment |
---|---|---|---|---|
80.0 | 310. | ME | Stephenson and Malanowski, 1987 | Based on data from 298. to 323. K. See also DePablo, 1976.; AC |
Enthalpy of fusion
ΔfusH (kJ/mol) | Temperature (K) | Method | Reference | Comment |
---|---|---|---|---|
22.71 | 374. | DSC | Donnelly, Drewes, et al., 1990, 2 | AC |

References

Donnelly, Drewes, et al., 1990
Donnelly, J.R.; Drewes, L.A.; Johnson, R.L.; Munslow, W.D.; Knapp, K.K.; Sovocool, G.W.,
Purity and heat of fusion data for environmental standards as determined by differential scanning calorimetry,
Thermochim. Acta, 1990, 167, 2, 155, https://doi.org/10.1016/0040-6031(90)80476-F
. [all data]
Plato and Glasgow, 1969
Plato, C.; Glasgow, A.R., Jr.,
Differential scanning calorimetry as a general method for determining the purity and heat of fusion of high-purity organic chemicals. Application to 95 compounds,
Anal. Chem., 1969, 41, 2, 330, https://doi.org/10.1021/ac60271a041
. [all data]
Stephenson and Malanowski, 1987
Stephenson, Richard M.; Malanowski, Stanislaw,
Handbook of the Thermodynamics of Organic Compounds, 1987, https://doi.org/10.1007/978-94-009-3173-2
. [all data]
DePablo, 1976
DePablo, Raul S.,
Determination of saturated vapor pressure in range 10-1-10-4 torr by effusion method,
J. Chem. Eng. Data, 1976, 21, 2, 141-143, https://doi.org/10.1021/je60069a033
. [all data]
Donnelly, Drewes, et al., 1990, 2
Donnelly, J.R.; Drewes, L.A.; Johnson, R.L.; Munslow, W.D.; Knapp, K.K.; Sovocool, G.W.,
Purity and heat of fusion data for environmental standards as determined by differential scanning calorimetry,
Thermochimica Acta, 1990, 167, 2, 155-187, https://doi.org/10.1016/0040-6031(90)80476-F
. [all data]