Tri(2-chloroethyl) phosphate
- Formula: C6H12Cl3O4P
- Molecular weight: 285.490
- IUPAC Standard InChIKey: HQUQLFOMPYWACS-UHFFFAOYSA-N
- CAS Registry Number: 115-96-8
- Chemical structure:
View 3d structure (requires JavaScript / HTML 5) - Other names: Ethanol, 2-chloro-, phosphate (3:1); Celluflex CEF; Disflamoll TCA; Fyrol CEF; Niax Flame Retardant 3CF; Niax 3CF; Tri(β-chloroethyl) phosphate; Trichloroethyl phosphate; Tris(β-chloroethyl) phosphate; Tris(chloroethyl) phosphate; Tris(2-chloroethyl) orthophosphate; Tris(2-chloroethyl) phosphate; 3CF; Celluflex; Phosphoric acid, tris(2-chloroethyl) ester; Trichlorethyl phosphate; 2-Chloroethanol phosphate; NCI-C60128; Tris-(2-chlorethyl)fosfat; 2-Chloro-ethanol phosphate (3:1); Fyrol CF; Genomoll P; TCEP; Phosphoric acid, tri-2-chloroethyl ester; NSC 3213

Phase change data

Data compiled by: William E. Acree, Jr., James S. Chickos
Enthalpy of vaporization
ΔvapH (kJ/mol) | Temperature (K) | Method | Reference | Comment |
---|---|---|---|---|
36.7 | 308. | A | Stephenson and Malanowski, 1987 | Based on data from 293. to 445. K. See also Dykyj, 1972. |

Kovats' RI, non-polar column, custom temperature program

Column type | Active phase | I | Reference | Comment |
---|---|---|---|---|
Packed | SE-30 | 1740. | Ramsey, Lee, et al., 1980 | He, Chromosorb G HP (80-100 mesh); Column length: 1.5 m; Program: not specified |

Van Den Dool and Kratz RI, non-polar column, custom temperature program

Column type | Active phase | I | Reference | Comment |
---|---|---|---|---|
Capillary | HP-5MS | 1776. | Hankemeier, Rozenbrand, et al., 1998 | Program: not specified |
Capillary | HP-5MS | 1777. | Hankemeier, Rozenbrand, et al., 1998 | Program: not specified |
Capillary | HP-5MS | 1781. | Hankemeier, Rozenbrand, et al., 1998 | Program: not specified |
Capillary | HP-5MS | 1782. | Hankemeier, Rozenbrand, et al., 1998 | Program: not specified |
Capillary | 5 % Phenyl methyl siloxane | 1766. | Yasuhara, Shiraishi, et al., 1997 | 25. m/0.31 mm/0.52 μm, He; Program: 50C(2min) => (20C/min) => 120C => (7C/min) => 310C(10min) |

Normal alkane RI, non-polar column, custom temperature program

Column type | Active phase | I | Reference | Comment |
---|---|---|---|---|
Capillary | OV-1, SE-30, Methyl silicone, SP-2100, OV-101, DB-1, etc. | 1740. | Waggott and Davies, 1984 | Hydrogen; Column length: 50. m; Column diameter: 0.32 mm; Program: not specified |
Other | Methyl Silicone | 1740. | Ardrey and Moffat, 1981 | Program: not specified |

Lee's RI, non-polar column, custom temperature program

Column type | Active phase | I | Reference | Comment |
---|---|---|---|---|
Capillary | Methyl Silicone | 295.96 | Eckel, Ross, et al., 1993 | Program: not specified |

References

Stephenson and Malanowski, 1987
Stephenson, Richard M.; Malanowski, Stanislaw,
Handbook of the Thermodynamics of Organic Compounds, 1987, https://doi.org/10.1007/978-94-009-3173-2
. [all data]
Dykyj, 1972
Dykyj, J.,
Petrochemia, 1972, 12, 1, 13. [all data]
Ramsey, Lee, et al., 1980
Ramsey, J.D.; Lee, T.D.; Osselton, M.D.; Moffat, A.C.,
Gas-liquid chromatographic retention indices of 296 non-drug substances on SE-30 or OV-1 likely to be encountered in toxicological analyses,
J. Chromatogr., 1980, 184, 2, 185-206, https://doi.org/10.1016/S0021-9673(00)85641-1
. [all data]
Hankemeier, Rozenbrand, et al., 1998
Hankemeier, Th.; Rozenbrand, J.; Abhadur, M.; Vreuls, J.J.; Brinkman, U.A.Th.,
Data Correlation in On-Line Solid-Phase Extraction - Gas Chromatography - Atomic Emission / Mass Spectrometric Detection of Unknown Microcontaminants,
Chromatographia, 1998, 48, 3/4, 273-283, https://doi.org/10.1007/BF02467683
. [all data]
Yasuhara, Shiraishi, et al., 1997
Yasuhara, A.; Shiraishi, H.; Nishikawa, M.; Yamamoto, T.; Uehiro, T.; Nakasugi, O.; Okumura, T.; Kenmotsu, K.; Fukui, H.; Nagase, M.; Ono, Y.; Kawagoshi, Y.; Baba, K.; Noma, Y.,
Determination of organic components in leachates from hazardous waste disposal sites in Japan by gas chromatography-mass spectrometry,
J. Chromatogr. A, 1997, 774, 1-2, 321-332, https://doi.org/10.1016/S0021-9673(97)00078-2
. [all data]
Waggott and Davies, 1984
Waggott, A.; Davies, I.W.,
Identification of organic pollutants using linear temperature programmed retention indices (LTPRIs) - Part II, 1984, retrieved from http://dwi.defra.gov.uk/research/completed-research/reports/dwi0383.pdf. [all data]
Ardrey and Moffat, 1981
Ardrey, R.E.; Moffat, A.C.,
Gas-liquid chromatographic retention indices of 1318 substances of toxicological interest on SE-30 or OV-1 stationary phase,
J. Chromatogr., 1981, 220, 3, 195-252, https://doi.org/10.1016/S0021-9673(00)81925-1
. [all data]
Eckel, Ross, et al., 1993
Eckel, W.P.; Ross, B.; Isensee, R.K.,
Pentobarbital found in ground water,
Ground Water, 1993, 31, 5, 801-804, https://doi.org/10.1111/j.1745-6584.1993.tb00853.x
. [all data]