Triphenyl phosphate
- Formula: C18H15O4P
- Molecular weight: 326.2831
- IUPAC Standard InChIKey: XZZNDPSIHUTMOC-UHFFFAOYSA-N
- CAS Registry Number: 115-86-6
- Chemical structure:
View 3d structure (requires JavaScript / HTML 5) - Other names: TPP; Phosphoric acid, triphenyl ester; Celluflex TPP; Disflamoll TP; Phenyl phosphate ((PhO)3PO); Phosflex TPP; Triphenoxyphosphine oxide; TP; Trifenylfosfat; Altal; Kronitex TPP; Phenyl phosphate; Triphenyl phosphoric acid ester; NSC 57868

Condensed phase thermochemistry data

Data compiled by: Eugene S. Domalski and Elizabeth D. Hearing
Quantity | Value | Units | Method | Reference | Comment |
---|---|---|---|---|---|
S°solid,1 bar | 397.5 | J/mol*K | N/A | Rabinovich, Pet'kov, et al., 1986 |
Constant pressure heat capacity of solid
Cp,solid (J/mol*K) | Temperature (K) | Reference | Comment |
---|---|---|---|
356.2 | 300. | Rabinovich, Pet'kov, et al., 1986 | T = 12 to 340 K. |

Phase change data

Data compiled as indicated in comments:
TRC - Thermodynamics Research Center, NIST Boulder Laboratories, Chris Muzny director
AC - William E. Acree, Jr., James S. Chickos
DH - Eugene S. Domalski and Elizabeth D. Hearing
Quantity | Value | Units | Method | Reference | Comment |
---|---|---|---|---|---|
Ttriple | 322.55 | K | N/A | Rabinovich, Pet'kov, et al., 1986, 2 | Uncertainty assigned by TRC = 0.02 K; TRC |
Quantity | Value | Units | Method | Reference | Comment |
ΔsubH° | 114.4 ± 2.6 | kJ/mol | B | Kirklin and Domalski, 1989 | AC |
Enthalpy of vaporization
ΔvapH (kJ/mol) | Temperature (K) | Method | Reference | Comment |
---|---|---|---|---|
81.4 | 563. | I,A | Stephenson and Malanowski, 1987 | Based on data from 548. to 683. K. See also Dobry and Keller, 1957.; AC |
Antoine Equation Parameters
log10(P) = A − (B / (T + C))
P = vapor pressure (bar)
T = temperature (K)
View plot Requires a JavaScript / HTML 5 canvas capable browser.
Temperature (K) | A | B | C | Reference | Comment |
---|---|---|---|---|---|
466.7 to 686.7 | 5.05425 | 3034.786 | -84.233 | Stull, 1947 | Coefficents calculated by NIST from author's data. |
Enthalpy of fusion
ΔfusH (kJ/mol) | Temperature (K) | Reference | Comment |
---|---|---|---|
29.610 | 322.55 | Rabinovich, Pet'kov, et al., 1986 | DH |
29.61 | 322.5 | Acree, 1991 | AC |
Entropy of fusion
ΔfusS (J/mol*K) | Temperature (K) | Reference | Comment |
---|---|---|---|
91.84 | 322.55 | Rabinovich, Pet'kov, et al., 1986 | DH |

Kovats' RI, non-polar column, custom temperature program

Column type | Active phase | I | Reference | Comment |
---|---|---|---|---|
Packed | SE-30 | 2363. | Ramsey, Lee, et al., 1980 | He, Chromosorb G HP (80-100 mesh); Column length: 1.5 m; Program: not specified |

Van Den Dool and Kratz RI, non-polar column, temperature ramp

Column type | Active phase | I | Reference | Comment |
---|---|---|---|---|
Capillary | DB-1 | 2320. | Johnson, Urso, et al., 1997 | 30. m/0.2 mm/0.25 μm, 50. C @ 2. min, 5. K/min, 300. C @ 5. min |
Packed | SE-30 | 2359. | Messadi and Vergnaud, 1979 | N2, Chromosorb Q, 10. K/min; Tstart: 100. C; Tend: 340. C |

Van Den Dool and Kratz RI, non-polar column, custom temperature program

Column type | Active phase | I | Reference | Comment |
---|---|---|---|---|
Capillary | OV-101 | 2330. | Yasuhara, Shiraishi, et al., 1997 | 15. m/0.25 mm/0.25 μm, He; Program: 50C(2min) => (20C/min) => 120C => (7C/min) => 310C(10min) |
Capillary | 5 % Phenyl methyl siloxane | 2392. | Yasuhara, Shiraishi, et al., 1997 | 25. m/0.31 mm/0.52 μm, He; Program: 50C(2min) => (20C/min) => 120C => (7C/min) => 310C(10min) |

Normal alkane RI, non-polar column, temperature ramp

Column type | Active phase | I | Reference | Comment |
---|---|---|---|---|
Capillary | HP-1 | 2366. | Boatright and Crum, 1997 | 30. m/0.25 mm/0.1 μm, He, 50. C @ 2. min, 5. K/min, 300. C @ 3. min |

Normal alkane RI, non-polar column, custom temperature program

Column type | Active phase | I | Reference | Comment |
---|---|---|---|---|
Capillary | Polydimethyl siloxanes | 2363. | Schutz and Wollrab A., 1988 | Program: not specified |
Capillary | OV-1, SE-30, Methyl silicone, SP-2100, OV-101, DB-1, etc. | 2363. | Waggott and Davies, 1984 | Hydrogen; Column length: 50. m; Column diameter: 0.32 mm; Program: not specified |
Other | Methyl Silicone | 2363. | Ardrey and Moffat, 1981 | Program: not specified |

Lee's RI, non-polar column, temperature ramp

Column type | Active phase | I | Reference | Comment |
---|---|---|---|---|
Capillary | DB-1 | 391.9 | Johnson, Urso, et al., 1997 | 30. m/0.2 mm/0.25 μm, 50. C @ 2. min, 5. K/min, 300. C @ 5. min |

References

Rabinovich, Pet'kov, et al., 1986
Rabinovich, I.B.; Pet'kov, V.I.; Zarudaeva, S.S.; Ovchinnikov, E.Yu.,
Specific heat and thermodynamic functions of triphenyl phosphate at 12-340 K,
Zhur. Fiz. Khim., 1986, 60, 767-769. [all data]
Rabinovich, Pet'kov, et al., 1986, 2
Rabinovich, I.B.; Pet'kov, V.I.; Zarudaeva, S.S.; Ovchinnikov, E.Yu.,
Specific heat and thermodynamic functions of triphenyl phosphate at 12-340K,
Zh. Fiz. Khim., 1986, 60, 767. [all data]
Kirklin and Domalski, 1989
Kirklin, Duane R.; Domalski, Eugene S.,
Energy of combustion of triphenylphosphate,
The Journal of Chemical Thermodynamics, 1989, 21, 5, 449-456, https://doi.org/10.1016/0021-9614(89)90162-6
. [all data]
Stephenson and Malanowski, 1987
Stephenson, Richard M.; Malanowski, Stanislaw,
Handbook of the Thermodynamics of Organic Compounds, 1987, https://doi.org/10.1007/978-94-009-3173-2
. [all data]
Dobry and Keller, 1957
Dobry, Alan; Keller, Richard,
Vapor Pressures of Some Phosphate and Phosphonate Esters,
J. Phys. Chem., 1957, 61, 10, 1448-1449, https://doi.org/10.1021/j150556a052
. [all data]
Stull, 1947
Stull, Daniel R.,
Vapor Pressure of Pure Substances. Organic and Inorganic Compounds,
Ind. Eng. Chem., 1947, 39, 4, 517-540, https://doi.org/10.1021/ie50448a022
. [all data]
Acree, 1991
Acree, William E.,
Thermodynamic properties of organic compounds: enthalpy of fusion and melting point temperature compilation,
Thermochimica Acta, 1991, 189, 1, 37-56, https://doi.org/10.1016/0040-6031(91)87098-H
. [all data]
Lang editor), 1967
Lang editor), L.,
Absorption Spectra in the Ultraviolet and Visible Region, 1967, 8, 143. [all data]
Ramsey, Lee, et al., 1980
Ramsey, J.D.; Lee, T.D.; Osselton, M.D.; Moffat, A.C.,
Gas-liquid chromatographic retention indices of 296 non-drug substances on SE-30 or OV-1 likely to be encountered in toxicological analyses,
J. Chromatogr., 1980, 184, 2, 185-206, https://doi.org/10.1016/S0021-9673(00)85641-1
. [all data]
Johnson, Urso, et al., 1997
Johnson, C.I.; Urso, A.; Geleta, L.,
Broad spectrum analysis of municipal and industrial effluents discharged into the Peace, Athabasca and Slave river basins: characterization of effluent samples, 1994 - Volume 1 of 2, Northern River Basins Study Project Report No. 121, Norther River Basins Study, Edmonton, Alberta, 1997, 27. [all data]
Messadi and Vergnaud, 1979
Messadi, D.; Vergnaud, J.-M.,
Quick identification and analysis of plasticizers in PVC by programmed-temperature gas chromatography using the best stationary phases,
J. Appl. Polym. Sci., 1979, 24, 5, 1215-1225, https://doi.org/10.1002/app.1979.070240507
. [all data]
Yasuhara, Shiraishi, et al., 1997
Yasuhara, A.; Shiraishi, H.; Nishikawa, M.; Yamamoto, T.; Uehiro, T.; Nakasugi, O.; Okumura, T.; Kenmotsu, K.; Fukui, H.; Nagase, M.; Ono, Y.; Kawagoshi, Y.; Baba, K.; Noma, Y.,
Determination of organic components in leachates from hazardous waste disposal sites in Japan by gas chromatography-mass spectrometry,
J. Chromatogr. A, 1997, 774, 1-2, 321-332, https://doi.org/10.1016/S0021-9673(97)00078-2
. [all data]
Boatright and Crum, 1997
Boatright, W.L.; Crum, A.D.,
Nonpolar-volatile lipids from soy protein isolates and hexane-defatted flakes,
J. Amer. Oil Chem. Soc., 1997, 74, 4, 461-467, https://doi.org/10.1007/s11746-997-0107-z
. [all data]
Schutz and Wollrab A., 1988
Schutz, H.; Wollrab A.,
The significance of the retention index in toxicologic analysis II,
Pharmazie in unzerer Zeit, 1988, 17, 4, 97-101. [all data]
Waggott and Davies, 1984
Waggott, A.; Davies, I.W.,
Identification of organic pollutants using linear temperature programmed retention indices (LTPRIs) - Part II, 1984, retrieved from http://dwi.defra.gov.uk/research/completed-research/reports/dwi0383.pdf. [all data]
Ardrey and Moffat, 1981
Ardrey, R.E.; Moffat, A.C.,
Gas-liquid chromatographic retention indices of 1318 substances of toxicological interest on SE-30 or OV-1 stationary phase,
J. Chromatogr., 1981, 220, 3, 195-252, https://doi.org/10.1016/S0021-9673(00)81925-1
. [all data]