Potassium octamer, positive ion
- Formula: K8+
- Molecular weight: 312.7859
- CAS Registry Number: 115774-20-4

Ion clustering data

Data compiled by: Michael M. Meot-Ner (Mautner) and Sharon G. Lias
Clustering reactions
By formula: K8+ + K2 = (K8+ • K2)
Quantity | Value | Units | Method | Reference | Comment |
---|---|---|---|---|---|
ΔrH° | 20.3 | kcal/mol | PDiss | Brechignac, Cahuzac, et al., 1990 | gas phase |

References

Brechignac, Cahuzac, et al., 1990
Brechignac, C.; Cahuzac, P.; Carlier, F.; De Frutos, M.; Leyniger, J.,
Cohesive Energies of (K)n+ 5<n<200 from Photoevaporation Experiments,
J. Chem. Phys., 1990, 93, 10, 7449, https://doi.org/10.1063/1.459418
. [all data]