1,3-Propanediol, 2,2-diethyl-
- Formula: C7H16O2
- Molecular weight: 132.2007
- IUPAC Standard InChIKey: XRVCFZPJAHWYTB-UHFFFAOYSA-N
- CAS Registry Number: 115-76-4
- Chemical structure:
View 3d structure (requires JavaScript / HTML 5) - Other names: DEP; Prenderol; 2,2-Diethyl-1,3-propanediol; 3,3-Dimethylol pentane; MC 1415; Penderol; Prendiol; 2,2-Diethylpropane-1,3-diol; 2,2-Diethylpropanediol-1,3; 3,3-Bis(hydroxymethyl)pentane; NSC 12211; 2,2-diethylpropanediol

Phase change data

Data compiled as indicated in comments:
TRC - Thermodynamics Research Center, NIST Boulder Laboratories, Chris Muzny director
AC - William E. Acree, Jr., James S. Chickos
Quantity | Value | Units | Method | Reference | Comment |
---|---|---|---|---|---|
Tfus | 398.15 | K | N/A | Mellan, 1962 | Uncertainty assigned by TRC = 6. K; TRC |
Tfus | 334.7 | K | N/A | Joshi and Bhide, 1960 | Uncertainty assigned by TRC = 2. K; TRC |
Tfus | 334.5 | K | N/A | Anonymous, 1954 | Uncertainty assigned by TRC = 0.6 K; TRC |
Tfus | 334.5 | K | N/A | Shortridge, Craig, et al., 1948 | Uncertainty assigned by TRC = 0.5 K; TRC |
Quantity | Value | Units | Method | Reference | Comment |
ΔvapH° | 80.2 ± 0.2 | kJ/mol | N/A | Verevkin, 2007 | Based on data from 343. to 380. K.; AC |

References

Mellan, 1962
Mellan, I.,
Polyhydric Alcohols, Spartan Books: Washington, DC, 1962. [all data]
Joshi and Bhide, 1960
Joshi, V.S.; Bhide, B.V.,
1,3-Propanediols and Their Derivatives,
J. Indian Chem. Soc., 1960, 37, 461-4. [all data]
Anonymous, 1954
Anonymous, R.,
, Am. Pet. Inst. Res. Proj. 45, Tech. Rep. 13, Ohio State Univ., 1954. [all data]
Shortridge, Craig, et al., 1948
Shortridge, R.W.; Craig, R.A.; Greenlee, K.W.; Derfer, J.M.; Boord, C.E.,
The Synthesis of Some Cyclopropane and Spirane Hydrocarbons,
J. Am. Chem. Soc., 1948, 70, 946. [all data]
Verevkin, 2007
Verevkin, Sergey P.,
Vapor Pressures and Enthalpies of Vaporization of a Series of the 1,3-Alkanediols,
J. Chem. Eng. Data, 2007, 52, 1, 301-308, https://doi.org/10.1021/je060419q
. [all data]