Paramethadione
- Formula: C7H11NO3
- Molecular weight: 157.1671
- IUPAC Standard InChIKey: VQASKUSHBVDKGU-UHFFFAOYSA-N
- CAS Registry Number: 115-67-3
- Chemical structure:
View 3d structure (requires JavaScript / HTML 5) - Other names: 2,4-Oxazolidinedione, 5-ethyl-3,5-dimethyl-; Paradione; Parametadione; A 348; 3,5-Dimethyl-5-ethyloxazolidine-2,4-dione; 5-Ethyl-3,5-dimethyloxazolidine-2,4-dione; Isoethadione; 5-Ethyl-3,5-dimethyl-2,4-oxazolidinedione

Phase change data

Data compiled by: Thermodynamics Research Center, NIST Boulder Laboratories, Chris Muzny director
Quantity | Value | Units | Method | Reference | Comment |
---|---|---|---|---|---|
Tfus | 334.45 | K | N/A | Mellan, 1962 | Uncertainty assigned by TRC = 0.5 K |

Normal alkane RI, non-polar column, custom temperature program

Column type | Active phase | I | Reference | Comment |
---|---|---|---|---|
Other | Methyl Silicone | 1120. | Ardrey and Moffat, 1981 | Program: not specified |

References

Mellan, 1962
Mellan, I.,
Polyhydric Alcohols, Spartan Books: Washington, DC, 1962. [all data]
Ardrey and Moffat, 1981
Ardrey, R.E.; Moffat, A.C.,
Gas-liquid chromatographic retention indices of 1318 substances of toxicological interest on SE-30 or OV-1 stationary phase,
J. Chromatogr., 1981, 220, 3, 195-252, https://doi.org/10.1016/S0021-9673(00)81925-1
. [all data]