trans-Nitrosobenzene dimer
- Formula: C12H10N2O2
- Molecular weight: 214.2200
- IUPAC Standard InChIKey: WHFNSVMCGRQIRC-BUHFOSPRSA-N
- CAS Registry Number: 115626-83-0
- Chemical structure:
View 3d structure (requires JavaScript / HTML 5) - Stereoisomers:

Reaction thermochemistry data

Data compiled by: Hussein Y. Afeefy, Joel F. Liebman, and Stephen E. Stein
Individual Reactions
By formula: C12H10N2O2 = 2C6H5NO
Quantity | Value | Units | Method | Reference | Comment |
---|---|---|---|---|---|
ΔrH° | 42.5 ± 1.2 | kJ/mol | Eqk | Orrell, Stephenson, et al., 1989 | liquid phase; solvent: CDCl3; NMR |
ΔrH° | 42.5 ± 1.2 | kJ/mol | Eqk | Orrell, Sik, et al., 1987 | liquid phase; solvent: CDCl3; NMR |

References

Orrell, Stephenson, et al., 1989
Orrell, K.G.; Stephenson, D.; Rault, T.,
NMR study of the monomer-dimer equilibria of dimethylnitrosobenzenes in solution. Identification of mixed azodioxy dimeric species,
Magn. Reson. Chem., 1989, 27, 368-376. [all data]
Orrell, Sik, et al., 1987
Orrell, K.G.; Sik, V.; Stephenson, D.,
Study of the monomer-dimer equilibrium of nitrosobenzene using multinuclear one- and two-dimensional NMR techniques,
Magn. Reson. Chem., 1987, 25, 1007-1011. [all data]