Benzalhippuric acid
- Formula: C16H13NO3
- Molecular weight: 267.2793
- IUPAC Standard InChIKey: HHWCUKQKFIVCEZ-SDNWHVSQSA-N
- CAS Registry Number: 1155-48-2
- Chemical structure:
View 3d structure (requires JavaScript / HTML 5) - Permanent link for this species. Use this link for bookmarking this species for future reference.

Condensed phase thermochemistry data

Data compiled by: Hussein Y. Afeefy, Joel F. Liebman, and Stephen E. Stein
Quantity | Value | Units | Method | Reference | Comment |
---|---|---|---|---|---|
ΔcH°solid | -7769.4 | kJ/mol | Ccb | Lemoult, 1904 |

References

Lemoult, 1904
Lemoult, M.P.,
Remarques sur une serie recenie de determinations calorimetriques,
Compt. Rend., 1904, 663-635. [all data]