Barbituric acid, 5-allyl-5-phenyl-
- Formula: C13H12N2O3
- Molecular weight: 244.2460
- IUPAC Standard InChIKey: WOIGZSBYKGQJGL-UHFFFAOYSA-N
- CAS Registry Number: 115-43-5
- Chemical structure:
View 3d structure (requires JavaScript / HTML 5) - Other names: 2,4,6(1H,3H,5H)-Pyrimidinetrione, 5-phenyl-5-(2-propenyl)-; Allofenyl; Allophenylum; Alphasem; Alpheba; Alphenal; Alphenate; Dorlotin; Fenallymal; Luxomnin; Phenallymal; Phenallymalum; Prophenal; 5-Allyl-5-phenylbarbituric acid; 5-Phenyl-5-allylbarbituric acid; Acido 5-fenil-5-allilbarbiturico; Tubergal; 5-Phenyl-5-(2-propenyl)-2,4,6(1H,3H,5H)-pyrimidinetrione; Lubergal; Phenyral; 5-Allyl-5-phenyl-2,4,6(1H,3H,5H)-pyrimidinetrione; 5-Allyl-5-phenyl-barbituric acid (alphenal)

Van Den Dool and Kratz RI, non-polar column, custom temperature program

Column type | Active phase | I | Reference | Comment |
---|---|---|---|---|
Capillary | VF-5MS | 2089.5 | Tret'yakov, 2008 | 30. m/0.25 mm/0.25 μm, He; Program: Multi-step temperature program; T(initial)=60C; T(final)=270C |

Normal alkane RI, non-polar column, custom temperature program

Column type | Active phase | I | Reference | Comment |
---|---|---|---|---|
Other | Methyl Silicone | 2106. | Ardrey and Moffat, 1981 | Program: not specified |
Other | Methyl Silicone | 2106. | Ardrey and Moffat, 1981 | Program: not specified |

References

Tret'yakov, 2008
Tret'yakov, K.V.,
Retention Data. NIST Mass Spectrometry Data Center., NIST Mass Spectrometry Data Center, 2008. [all data]
Ardrey and Moffat, 1981
Ardrey, R.E.; Moffat, A.C.,
Gas-liquid chromatographic retention indices of 1318 substances of toxicological interest on SE-30 or OV-1 stationary phase,
J. Chromatogr., 1981, 220, 3, 195-252, https://doi.org/10.1016/S0021-9673(00)81925-1
. [all data]