Oxyphenisatin Acetate
- Formula: C24H19NO5
- Molecular weight: 401.4114
- IUPAC Standard InChIKey: PHPUXYRXPHEJDF-UHFFFAOYSA-N
- CAS Registry Number: 115-33-3
- Chemical structure:
View 3d structure (requires JavaScript / HTML 5) - Other names: 3,3-Bis(4-acetoxyphenyl)oxindole; 3,3-Bis(p-acetoxyphenyl)oxindole; Acetophenolisatin; 2H-Indol-2-one, 3,3-bis[4-(acetyloxy)phenyl]-1,3-dihydro-; Acelax; Acetalax; Bisatin; Brocatine; Cirotyl; Contax; Darmoletten; Diacetoxydiphenylisatin; Diacetyl bis(hydroxyphenyl)isatin; Diacetyl bis(p-hydroxyphenyl)isatin; Diacetyldihydroxydiphenylisatin; Diacetyldioxyphenylisatin; Diacetyldiphenolisatin; Diphesatin; Diphesatine; Eulaxin; Isacen; Isaphen; Isaphenin; Isatin, O,O'-diacetyldiphenol-; Isocrin; Izafenin; Laxo-Isatin; Laxocol; Lenavac; Lisagal; LA 96; Oxindole, 3,3'-bis(p-hydroxyphenyl)-, diacetate; Promassolax; Prulet; Prulet Liquitab; Puragaceen; Purgaceen; Purgophen; Sanapert; Tete-Lax; 2-Indolinone, 3,3-bis(p-hydroxyphenyl)-, diacetate (ester); 3,3-Bis(p-acetoxyphenyl)-2-indolinone; 3,3-Bis(p-hydroxyphenyl)-2-indolinone diacetate; 3,3-Bis(p-hydroxyphenyl)-2-indolinone diacetate (ester); 4,4'-Diacetoxydiphenylisatin; Lavema; Acetphenolisatin; Bydolax; NSC-59687; NSC 117186; 3,3-Bis[4-(acetyloxy)phenyl]-1,3-dihydro-2H-indol-2-one; oxyphenisatine di(acetate)

Phase change data

Data compiled by: Thermodynamics Research Center, NIST Boulder Laboratories, Chris Muzny director
Quantity | Value | Units | Method | Reference | Comment |
---|---|---|---|---|---|
Tfus | 524. | K | N/A | Kofler and Sitte, 1950 | Uncertainty assigned by TRC = 3. K; with "hot stage" |
Tfus | 516. | K | N/A | Kofler and Sitte, 1950 | Uncertainty assigned by TRC = 8. K; under a microscope |

References

Kofler and Sitte, 1950
Kofler, L.; Sitte, H.,
Melting Point Determination of Substances with Melt with Decomposition,
Monatsh. Chem., 1950, 81, 619. [all data]