Chlorendic anhydride
- Formula: C9H2Cl6O3
- Molecular weight: 370.828
- IUPAC Standard InChIKey: FLBJFXNAEMSXGL-UHFFFAOYSA-N
- CAS Registry Number: 115-27-5
- Chemical structure:
View 3d structure (requires JavaScript / HTML 5) - Other names: 4,7-Methanoisobenzofuran-1,3-dione, 4,5,6,7,8,8-hexachloro-3a,4,7,7a-tetrahydro-; 5-Norbornene-2,3-dicarboxylic anhydride, 1,4,5,6,7,7-hexachloro-; Chloran 542; Hexachloro-5-norbornene-2,3-dicarboxylic anhydride; Hexachloroendomethylene tetrahydrophthalic anhydride; HET Anhydride; 1,4,5,6,7,7-Hexachloro-5-norbornene-2,3-dicarboxylic anhydride; 1,4,5,6,7,7-Hexachlorobicyclo [2.2.1]hept-5-ene-2,3-dicarboxylic anhydride; 1,4,5,6,7,7-Hexachlorobicyclo[2.2.1]-5-heptene-2,3-dicarboxylic acid anhydride; Bicyclo[2.2.1]hept-5-ene-2,3-dicarboxylic anhydride, 1,4,5,6,7,7-hexachloro-; NSC 22229; 1,4,5,6,7,7-hexachloro-8,9,10-trinorborn-5-ene-2,3-dicarboxylic anhydride

Reaction thermochemistry data

Data compiled by: Hussein Y. Afeefy, Joel F. Liebman, and Stephen E. Stein
Individual Reactions
By formula: C9H2Cl6O3 = C4H2O3 + C5Cl6
Quantity | Value | Units | Method | Reference | Comment |
---|---|---|---|---|---|
ΔrH° | 315. | kJ/mol | Ion | Vijayakumar and Fink, 1983 | solid phase |

References

Vijayakumar and Fink, 1983
Vijayakumar, C.T.; Fink, J.K.,
Heat of formation of the Diels-Alder adduct of hexachlorocyclopentadiene and maleic anhydride by appearance-energy measurements,
Org. Mass Spectrom., 1983, 18, 134. [all data]