Acetaldehyde, tribromo-
- Formula: C2HBr3O
- Molecular weight: 280.741
- IUPAC Standard InChIKey: YTGSYRVSBPFKMQ-UHFFFAOYSA-N
- CAS Registry Number: 115-17-3
- Chemical structure:
View 3d structure (requires JavaScript / HTML 5) - Other names: Bromal; Tribromoacetaldehyde; 2,2,2-Tribromoacetaldehyde

Condensed phase thermochemistry data

Data compiled by: Hussein Y. Afeefy, Joel F. Liebman, and Stephen E. Stein
Quantity | Value | Units | Method | Reference | Comment |
---|---|---|---|---|---|
ΔfH°liquid | -88.7 | kJ/mol | Cm | Pritchard and Skinner, 1950 | Heat of hydrolysis |

Phase change data

Data compiled as indicated in comments:
BS - Robert L. Brown and Stephen E. Stein
TRC - Thermodynamics Research Center, NIST Boulder Laboratories, Chris Muzny director
AC - William E. Acree, Jr., James S. Chickos
Quantity | Value | Units | Method | Reference | Comment |
---|---|---|---|---|---|
Tboil | 447.2 | K | N/A | Weast and Grasselli, 1989 | BS |
Tboil | 447.15 | K | N/A | Kahlbaum, 1884 | Uncertainty assigned by TRC = 1.5 K; TRC |
Reduced pressure boiling point
Tboil (K) | Pressure (bar) | Reference | Comment |
---|---|---|---|
334.2 | 0.01 | Weast and Grasselli, 1989 | BS |
Enthalpy of vaporization
ΔvapH (kJ/mol) | Temperature (K) | Method | Reference | Comment |
---|---|---|---|---|
47.8 | 306. | A | Stephenson and Malanowski, 1987 | Based on data from 291. to 447. K. See also Stull, 1947.; AC |
Antoine Equation Parameters
log10(P) = A − (B / (T + C))
P = vapor pressure (bar)
T = temperature (K)
View plot Requires a JavaScript / HTML 5 canvas capable browser.
Temperature (K) | A | B | C | Reference | Comment |
---|---|---|---|---|---|
291.7 to 447. | 5.1070 | 2196.104 | -16.573 | Stull, 1947 | Coefficents calculated by NIST from author's data. |

Reaction thermochemistry data

Data compiled by: Hussein Y. Afeefy, Joel F. Liebman, and Stephen E. Stein
Individual Reactions
By formula: C2HBr3O + HNaO = CHNaO2 + CHBr3
Quantity | Value | Units | Method | Reference | Comment |
---|---|---|---|---|---|
ΔrH° | -93.72 | kJ/mol | Cm | Pritchard and Skinner, 1950 | liquid phase; Heat of hydrolysis |

References

Pritchard and Skinner, 1950
Pritchard, H.O.; Skinner, H.A.,
The heats of hydrolysis of chloral and bromal, and the C-C bond dissociation energies in chloral and bromal,
J. Am. Chem. Soc., 1950, 1928-1931. [all data]
Weast and Grasselli, 1989
CRC Handbook of Data on Organic Compounds, 2nd Editon, Weast,R.C and Grasselli, J.G., ed(s)., CRC Press, Inc., Boca Raton, FL, 1989, 1. [all data]
Kahlbaum, 1884
Kahlbaum, G.W.A.,
The dependence of Boiling Temperature on Air Pressure,
Ber. Dtsch. Chem. Ges., 1884, 17, 1245. [all data]
Stephenson and Malanowski, 1987
Stephenson, Richard M.; Malanowski, Stanislaw,
Handbook of the Thermodynamics of Organic Compounds, 1987, https://doi.org/10.1007/978-94-009-3173-2
. [all data]
Stull, 1947
Stull, Daniel R.,
Vapor Pressure of Pure Substances. Organic and Inorganic Compounds,
Ind. Eng. Chem., 1947, 39, 4, 517-540, https://doi.org/10.1021/ie50448a022
. [all data]