Dimethyl ether
- Formula: C2H6O
- Molecular weight: 46.0684
- IUPAC Standard InChIKey: LCGLNKUTAGEVQW-UHFFFAOYSA-N
- CAS Registry Number: 115-10-6
- Chemical structure:
- Other names: Methane, oxybis-; Methyl ether; Methoxymethane; Wood ether; Oxybismethane; (CH3)2O; Ether, dimethyl; Ether, methyl; UN 1033; Dimethyl oxide; Dymel A; Dymel; Demeon D; DME; Methane, 1,1'-oxybis-

Condensed phase thermochemistry data

Data compiled by: Eugene S. Domalski and Elizabeth D. Hearing
Quantity | Value | Units | Method | Reference | Comment |
---|---|---|---|---|---|
S°liquid | 146.57 | J/mol*K | N/A | Kennedy, Sagenkahn, et al., 1941 |
Constant pressure heat capacity of liquid
Cp,liquid (J/mol*K) | Temperature (K) | Reference | Comment |
---|---|---|---|
102.30 | 240. | Kennedy, Sagenkahn, et al., 1941 | T = 14 to 240 K. |

Reaction thermochemistry data

Data compiled as indicated in comments:
RCD - Robert C. Dunbar
M - Michael M. Meot-Ner (Mautner) and Sharon G. Lias
B - John E. Bartmess
Reactions 1 to 50
By formula: Li+ + C2H6O = (Li+ • C2H6O)
Quantity | Value | Units | Method | Reference | Comment |
---|---|---|---|---|---|
ΔrH° | 165. ± 11. | kJ/mol | CIDT | Rodgers and Armentrout, 2000 | RCD |
ΔrH° | 165. | kJ/mol | ICR | Woodin and Beauchamp, 1978 | gas phase; switching reaction(Li+)H2O, Entropy change calculated or estimated; Dzidic and Kebarle, 1970 extrapolated; M |
ΔrH° | 160. | kJ/mol | ICR | Staley and Beauchamp, 1975 | gas phase; switching reaction(Li+)H2O, from graph; Dzidic and Kebarle, 1970 extrapolated; M |
Quantity | Value | Units | Method | Reference | Comment |
ΔrS° | 110. | J/mol*K | N/A | Woodin and Beauchamp, 1978 | gas phase; switching reaction(Li+)H2O, Entropy change calculated or estimated; Dzidic and Kebarle, 1970 extrapolated; M |
Quantity | Value | Units | Method | Reference | Comment |
ΔrG° | 131. | kJ/mol | ICR | Woodin and Beauchamp, 1978 | gas phase; switching reaction(Li+)H2O, Entropy change calculated or estimated; Dzidic and Kebarle, 1970 extrapolated; M |
Enthalpy of reaction
ΔrH° (kJ/mol) | T (K) | Method | Reference | Comment |
---|---|---|---|---|
165. (+10.,-0.) | CID | More, Gledening, et al., 1996 | gas phase; guided ion beam CID; M |
By formula: C3H7O2+ + C2H6O = (C3H7O2+ • C2H6O)
Bond type: Hydrogen bonds of the type OH-O between organics
Quantity | Value | Units | Method | Reference | Comment |
---|---|---|---|---|---|
ΔrH° | 126. | kJ/mol | ICR | Larson and McMahon, 1982 | gas phase; switching reaction((CH3)2OH+)(CH3)2O, Entropy change calculated or estimated; Grimsrud and Kebarle, 1973, Lias, Liebman, et al., 1984, Keesee and Castleman, 1986; M |
Quantity | Value | Units | Method | Reference | Comment |
ΔrS° | 120. | J/mol*K | N/A | Larson and McMahon, 1982 | gas phase; switching reaction((CH3)2OH+)(CH3)2O, Entropy change calculated or estimated; Grimsrud and Kebarle, 1973, Lias, Liebman, et al., 1984, Keesee and Castleman, 1986; M |
Quantity | Value | Units | Method | Reference | Comment |
ΔrG° | 90.4 | kJ/mol | ICR | Larson and McMahon, 1982 | gas phase; switching reaction((CH3)2OH+)(CH3)2O, Entropy change calculated or estimated; Grimsrud and Kebarle, 1973, Lias, Liebman, et al., 1984, Keesee and Castleman, 1986; M |
By formula: C4H9O2+ + C2H6O = (C4H9O2+ • C2H6O)
Bond type: Hydrogen bonds of the type OH-O between organics
Quantity | Value | Units | Method | Reference | Comment |
---|---|---|---|---|---|
ΔrH° | 125. | kJ/mol | ICR | Larson and McMahon, 1982 | gas phase; switching reaction((CH3)2OH+)(CH3)2O, Entropy change calculated or estimated; Grimsrud and Kebarle, 1973, Lias, Liebman, et al., 1984, Keesee and Castleman, 1986; M |
Quantity | Value | Units | Method | Reference | Comment |
ΔrS° | 122. | J/mol*K | N/A | Larson and McMahon, 1982 | gas phase; switching reaction((CH3)2OH+)(CH3)2O, Entropy change calculated or estimated; Grimsrud and Kebarle, 1973, Lias, Liebman, et al., 1984, Keesee and Castleman, 1986; M |
Quantity | Value | Units | Method | Reference | Comment |
ΔrG° | 88.7 | kJ/mol | ICR | Larson and McMahon, 1982 | gas phase; switching reaction((CH3)2OH+)(CH3)2O, Entropy change calculated or estimated; Grimsrud and Kebarle, 1973, Lias, Liebman, et al., 1984, Keesee and Castleman, 1986; M |
By formula: (Na+ • C2H6O) + C2H6O = (Na+ • 2C2H6O)
Quantity | Value | Units | Method | Reference | Comment |
---|---|---|---|---|---|
ΔrH° | 85. ± 7. | kJ/mol | AVG | N/A | Average of 7 values; Individual data points |
By formula: Na+ + C2H6O = (Na+ • C2H6O)
Quantity | Value | Units | Method | Reference | Comment |
---|---|---|---|---|---|
ΔrH° | 100. ± 5.4 | kJ/mol | CIDC | Amicangelo and Armentrout, 2001 | Anchor NH3=24.41; RCD |
ΔrH° | 91.6 ± 4.6 | kJ/mol | CIDT | Armentrout and Rodgers, 2000 | RCD |
ΔrH° | 92.0 ± 5.0 | kJ/mol | CIDT | Rodgers and Armentrout, 2000 | RCD |
ΔrH° | 92.9 ± 5.0 | kJ/mol | CIDT | More, Ray, et al., 1997 | RCD |
Free energy of reaction
ΔrG° (kJ/mol) | T (K) | Method | Reference | Comment |
---|---|---|---|---|
73.6 | 298. | IMRE | McMahon and Ohanessian, 2000 | Anchor alanine=39.89; RCD |
73.6 | 298. | CIDC | McMahon and Ohanessian, 2000 | RCD |
By formula: C10H10Fe+ + C2H6O = (C10H10Fe+ • C2H6O)
Quantity | Value | Units | Method | Reference | Comment |
---|---|---|---|---|---|
ΔrH° | 40. | kJ/mol | PHPMS | Meot-Ner (Mautner), 1989 | gas phase; Entropy change calculated or estimated, ΔrH<, DG<; M |
Quantity | Value | Units | Method | Reference | Comment |
ΔrS° | 84. | J/mol*K | N/A | Meot-Ner (Mautner), 1989 | gas phase; Entropy change calculated or estimated, ΔrH<, DG<; M |
Free energy of reaction
ΔrG° (kJ/mol) | T (K) | Method | Reference | Comment |
---|---|---|---|---|
15. | 250. | PHPMS | Meot-Ner (Mautner), 1989 | gas phase; Entropy change calculated or estimated, ΔrH<, DG<; M |
By formula: (CH5O+ • 2CH4O) + C2H6O = (CH5O+ • C2H6O • 2CH4O)
Bond type: Hydrogen bonds of the type OH-O between organics
Quantity | Value | Units | Method | Reference | Comment |
---|---|---|---|---|---|
ΔrH° | 72.0 | kJ/mol | PHPMS | Hiraoka, Grimsrud, et al., 1974 | gas phase; n, note proton affinities, core ion may be (CH3)2OH+; M |
Quantity | Value | Units | Method | Reference | Comment |
ΔrS° | 120. | J/mol*K | PHPMS | Hiraoka, Grimsrud, et al., 1974 | gas phase; n, note proton affinities, core ion may be (CH3)2OH+; M |
By formula: (CH5O+ • 3CH4O) + C2H6O = (CH5O+ • C2H6O • 3CH4O)
Bond type: Hydrogen bonds of the type OH-O between organics
Quantity | Value | Units | Method | Reference | Comment |
---|---|---|---|---|---|
ΔrH° | 57.3 | kJ/mol | PHPMS | Hiraoka, Grimsrud, et al., 1974 | gas phase; n, note proton affinities, core ion may be (CH3)2OH+; M |
Quantity | Value | Units | Method | Reference | Comment |
ΔrS° | 129. | J/mol*K | PHPMS | Hiraoka, Grimsrud, et al., 1974 | gas phase; n, note proton affinities, core ion may be (CH3)2OH+; M |
By formula: (CH5O+ • CH4O) + C2H6O = (CH5O+ • C2H6O • CH4O)
Bond type: Hydrogen bonds of the type OH-O between organics
Quantity | Value | Units | Method | Reference | Comment |
---|---|---|---|---|---|
ΔrH° | 91.6 | kJ/mol | PHPMS | Hiraoka, Grimsrud, et al., 1974 | gas phase; n, note proton affinities, core ion may be (CH3)2OH+; M |
Quantity | Value | Units | Method | Reference | Comment |
ΔrS° | 105. | J/mol*K | PHPMS | Hiraoka, Grimsrud, et al., 1974 | gas phase; n, note proton affinities, core ion may be (CH3)2OH+; M |
By formula: C2H7O+ + C2H6O = (C2H7O+ • C2H6O)
Bond type: Hydrogen bonds of the type OH-O between organics
Quantity | Value | Units | Method | Reference | Comment |
---|---|---|---|---|---|
ΔrH° | 134. | kJ/mol | PHPMS | Meot-Ner (Mautner) and Sieck, 1991 | gas phase; M |
ΔrH° | 128. | kJ/mol | PHPMS | Grimsrud and Kebarle, 1973 | gas phase; M |
Quantity | Value | Units | Method | Reference | Comment |
ΔrS° | 133. | J/mol*K | PHPMS | Meot-Ner (Mautner) and Sieck, 1991 | gas phase; M |
ΔrS° | 124. | J/mol*K | PHPMS | Grimsrud and Kebarle, 1973 | gas phase; M |
By formula: K+ + C2H6O = (K+ • C2H6O)
Quantity | Value | Units | Method | Reference | Comment |
---|---|---|---|---|---|
ΔrH° | 72.8 ± 4.2 | kJ/mol | CIDT | Rodgers and Armentrout, 2000 | RCD |
ΔrH° | 92.9 | kJ/mol | HPMS | Davidson and Kebarle, 1976 | gas phase; M |
ΔrH° | 87.0 | kJ/mol | HPMS | Davidson and Kebarle, 1976, 2 | gas phase; M |
Quantity | Value | Units | Method | Reference | Comment |
ΔrS° | 112. | J/mol*K | HPMS | Davidson and Kebarle, 1976 | gas phase; M |
ΔrS° | 104. | J/mol*K | HPMS | Davidson and Kebarle, 1976, 2 | gas phase; M |
By formula: CH5O+ + C2H6O = (CH5O+ • C2H6O)
Bond type: Hydrogen bonds of the type OH-O between organics
Quantity | Value | Units | Method | Reference | Comment |
---|---|---|---|---|---|
ΔrH° | 146. | kJ/mol | PHPMS | Hiraoka, Grimsrud, et al., 1974 | gas phase; n, note proton affinities, core ion may be ((CH3)2OH+; M |
Quantity | Value | Units | Method | Reference | Comment |
ΔrS° | 103. | J/mol*K | PHPMS | Hiraoka, Grimsrud, et al., 1974 | gas phase; n, note proton affinities, core ion may be ((CH3)2OH+; M |
(C2H7O+ • • 2) + = (C2H7O+ • 2 • 2)
By formula: (C2H7O+ • C2H6O • 2H2O) + C2H6O = (C2H7O+ • 2C2H6O • 2H2O)
Bond type: Hydrogen bonds of the type OH-O between organics
Quantity | Value | Units | Method | Reference | Comment |
---|---|---|---|---|---|
ΔrH° | 66.1 | kJ/mol | PHPMS | Hiraoka, Grimsrud, et al., 1974 | gas phase; n, Entropy change is questionable; M |
Quantity | Value | Units | Method | Reference | Comment |
ΔrS° | 153. | J/mol*K | PHPMS | Hiraoka, Grimsrud, et al., 1974 | gas phase; n, Entropy change is questionable; M |
By formula: (C2H7O+ • C2H6O) + H2O = (C2H7O+ • H2O • C2H6O)
Bond type: Hydrogen bond (positive ion to hydride)
Quantity | Value | Units | Method | Reference | Comment |
---|---|---|---|---|---|
ΔrH° | 68.2 | kJ/mol | PHPMS | Hiraoka, Grimsrud, et al., 1974 | gas phase; n, Entropy change is questionable; M |
Quantity | Value | Units | Method | Reference | Comment |
ΔrS° | 162. | J/mol*K | PHPMS | Hiraoka, Grimsrud, et al., 1974 | gas phase; n, Entropy change is questionable; M |
(C2H7O+ • • ) + = (C2H7O+ • 2 • )
By formula: (C2H7O+ • C2H6O • H2O) + C2H6O = (C2H7O+ • 2C2H6O • H2O)
Bond type: Hydrogen bonds of the type OH-O between organics
Quantity | Value | Units | Method | Reference | Comment |
---|---|---|---|---|---|
ΔrH° | 70.3 | kJ/mol | PHPMS | Hiraoka, Grimsrud, et al., 1974 | gas phase; n; M |
Quantity | Value | Units | Method | Reference | Comment |
ΔrS° | 111. | J/mol*K | PHPMS | Hiraoka, Grimsrud, et al., 1974 | gas phase; n; M |
(C2H7O+ • 2 • ) + = (C2H7O+ • 3 • )
By formula: (C2H7O+ • 2C2H6O • H2O) + C2H6O = (C2H7O+ • 3C2H6O • H2O)
Bond type: Hydrogen bonds between protonated and neutral organics
Quantity | Value | Units | Method | Reference | Comment |
---|---|---|---|---|---|
ΔrH° | 90.8 | kJ/mol | PHPMS | Tholman, Tonner, et al., 1994 | gas phase; M |
Quantity | Value | Units | Method | Reference | Comment |
ΔrS° | 174. | J/mol*K | PHPMS | Tholman, Tonner, et al., 1994 | gas phase; M |
(C2H7O+ • 2 • ) + = (C2H7O+ • 3 • )
By formula: (C2H7O+ • 2CH4O • C2H6O) + CH4O = (C2H7O+ • 3CH4O • C2H6O)
Bond type: Hydrogen bonds of the type OH-O between organics
Quantity | Value | Units | Method | Reference | Comment |
---|---|---|---|---|---|
ΔrH° | 51.0 | kJ/mol | PHPMS | Hiraoka, Grimsrud, et al., 1974 | gas phase; n; M |
Quantity | Value | Units | Method | Reference | Comment |
ΔrS° | 111. | J/mol*K | PHPMS | Hiraoka, Grimsrud, et al., 1974 | gas phase; n; M |
(C2H7O+ • • ) + = (C2H7O+ • 2 • )
By formula: (C2H7O+ • CH4O • C2H6O) + CH4O = (C2H7O+ • 2CH4O • C2H6O)
Bond type: Hydrogen bonds of the type OH-O between organics
Quantity | Value | Units | Method | Reference | Comment |
---|---|---|---|---|---|
ΔrH° | 63.2 | kJ/mol | PHPMS | Hiraoka, Grimsrud, et al., 1974 | gas phase; n; M |
Quantity | Value | Units | Method | Reference | Comment |
ΔrS° | 128. | J/mol*K | PHPMS | Hiraoka, Grimsrud, et al., 1974 | gas phase; n; M |
(C2H7O+ • • 2) + = (C2H7O+ • 2 • 2)
By formula: (C2H7O+ • H2O • 2C2H6O) + H2O = (C2H7O+ • 2H2O • 2C2H6O)
Bond type: Hydrogen bond (positive ion to hydride)
Quantity | Value | Units | Method | Reference | Comment |
---|---|---|---|---|---|
ΔrH° | 47.7 | kJ/mol | PHPMS | Hiraoka, Grimsrud, et al., 1974 | gas phase; n; M |
Quantity | Value | Units | Method | Reference | Comment |
ΔrS° | 127. | J/mol*K | PHPMS | Hiraoka, Grimsrud, et al., 1974 | gas phase; n; M |
(C2H7O+ • • 3) + = (C2H7O+ • 2 • 3)
By formula: (C2H7O+ • H2O • 3C2H6O) + H2O = (C2H7O+ • 2H2O • 3C2H6O)
Bond type: Hydrogen bond (positive ion to hydride)
Quantity | Value | Units | Method | Reference | Comment |
---|---|---|---|---|---|
ΔrH° | 47.7 | kJ/mol | PHPMS | Hiraoka, Grimsrud, et al., 1974 | gas phase; n; M |
Quantity | Value | Units | Method | Reference | Comment |
ΔrS° | 127. | J/mol*K | PHPMS | Hiraoka, Grimsrud, et al., 1974 | gas phase; n; M |
(C2H7O+ • 2 • ) + = (C2H7O+ • 3 • )
By formula: (C2H7O+ • 2H2O • C2H6O) + H2O = (C2H7O+ • 3H2O • C2H6O)
Bond type: Hydrogen bond (positive ion to hydride)
Quantity | Value | Units | Method | Reference | Comment |
---|---|---|---|---|---|
ΔrH° | 48.5 | kJ/mol | PHPMS | Hiraoka, Grimsrud, et al., 1974 | gas phase; n; M |
Quantity | Value | Units | Method | Reference | Comment |
ΔrS° | 112. | J/mol*K | PHPMS | Hiraoka, Grimsrud, et al., 1974 | gas phase; n; M |
(C2H7O+ • 2) + = (C2H7O+ • • 2)
By formula: (C2H7O+ • 2H2O) + C2H6O = (C2H7O+ • C2H6O • 2H2O)
Bond type: Hydrogen bonds of the type OH-O between organics
Quantity | Value | Units | Method | Reference | Comment |
---|---|---|---|---|---|
ΔrH° | 68.6 | kJ/mol | PHPMS | Hiraoka, Grimsrud, et al., 1974 | gas phase; n; M |
Quantity | Value | Units | Method | Reference | Comment |
ΔrS° | 95.4 | J/mol*K | PHPMS | Hiraoka, Grimsrud, et al., 1974 | gas phase; n; M |
(C2H7O+ • 3) + = (C2H7O+ • • 3)
By formula: (C2H7O+ • 3H2O) + C2H6O = (C2H7O+ • C2H6O • 3H2O)
Bond type: Hydrogen bonds of the type OH-O between organics
Quantity | Value | Units | Method | Reference | Comment |
---|---|---|---|---|---|
ΔrH° | 70.7 | kJ/mol | PHPMS | Hiraoka, Grimsrud, et al., 1974 | gas phase; n; M |
Quantity | Value | Units | Method | Reference | Comment |
ΔrS° | 138. | J/mol*K | PHPMS | Hiraoka, Grimsrud, et al., 1974 | gas phase; n; M |
(C2H7O+ • • ) + = (C2H7O+ • 2 • )
By formula: (C2H7O+ • H2O • C2H6O) + H2O = (C2H7O+ • 2H2O • C2H6O)
Bond type: Hydrogen bond (positive ion to hydride)
Quantity | Value | Units | Method | Reference | Comment |
---|---|---|---|---|---|
ΔrH° | 56.9 | kJ/mol | PHPMS | Hiraoka, Grimsrud, et al., 1974 | gas phase; n; M |
Quantity | Value | Units | Method | Reference | Comment |
ΔrS° | 103. | J/mol*K | PHPMS | Hiraoka, Grimsrud, et al., 1974 | gas phase; n; M |
By formula: (C2H7O+ • H2O) + C2H6O = (C2H7O+ • C2H6O • H2O)
Bond type: Hydrogen bonds of the type OH-O between organics
Quantity | Value | Units | Method | Reference | Comment |
---|---|---|---|---|---|
ΔrH° | 77.4 | kJ/mol | PHPMS | Hiraoka, Grimsrud, et al., 1974 | gas phase; n; M |
Quantity | Value | Units | Method | Reference | Comment |
ΔrS° | 110. | J/mol*K | PHPMS | Hiraoka, Grimsrud, et al., 1974 | gas phase; n; M |
(C2H7O+ • 2) + = (C2H7O+ • • 2)
By formula: (C2H7O+ • 2CH4O) + C2H6O = (C2H7O+ • C2H6O • 2CH4O)
Bond type: Hydrogen bonds of the type OH-O between organics
Quantity | Value | Units | Method | Reference | Comment |
---|---|---|---|---|---|
ΔrH° | 69.5 | kJ/mol | PHPMS | Hiraoka, Grimsrud, et al., 1974 | gas phase; n; M |
Quantity | Value | Units | Method | Reference | Comment |
ΔrS° | 133. | J/mol*K | PHPMS | Hiraoka, Grimsrud, et al., 1974 | gas phase; n; M |
(C2H7O+ • 3) + = (C2H7O+ • • 3)
By formula: (C2H7O+ • 3CH4O) + C2H6O = (C2H7O+ • C2H6O • 3CH4O)
Bond type: Hydrogen bonds of the type OH-O between organics
Quantity | Value | Units | Method | Reference | Comment |
---|---|---|---|---|---|
ΔrH° | 52.3 | kJ/mol | PHPMS | Hiraoka, Grimsrud, et al., 1974 | gas phase; n; M |
Quantity | Value | Units | Method | Reference | Comment |
ΔrS° | 107. | J/mol*K | PHPMS | Hiraoka, Grimsrud, et al., 1974 | gas phase; n; M |
By formula: (C2H7O+ • C2H6O) + CH4O = (C2H7O+ • CH4O • C2H6O)
Bond type: Hydrogen bonds of the type OH-O between organics
Quantity | Value | Units | Method | Reference | Comment |
---|---|---|---|---|---|
ΔrH° | 75.7 | kJ/mol | PHPMS | Hiraoka, Grimsrud, et al., 1974 | gas phase; n; M |
Quantity | Value | Units | Method | Reference | Comment |
ΔrS° | 128. | J/mol*K | PHPMS | Hiraoka, Grimsrud, et al., 1974 | gas phase; n; M |
By formula: (C2H7O+ • CH4O) + C2H6O = (C2H7O+ • C2H6O • CH4O)
Bond type: Hydrogen bonds of the type OH-O between organics
Quantity | Value | Units | Method | Reference | Comment |
---|---|---|---|---|---|
ΔrH° | 84.5 | kJ/mol | PHPMS | Hiraoka, Grimsrud, et al., 1974 | gas phase; n; M |
Quantity | Value | Units | Method | Reference | Comment |
ΔrS° | 125. | J/mol*K | PHPMS | Hiraoka, Grimsrud, et al., 1974 | gas phase; n; M |
By formula: (C2H7O+ • C2H6O) + C2H6O = (C2H7O+ • 2C2H6O)
Bond type: Hydrogen bonds of the type OH-O between organics
Quantity | Value | Units | Method | Reference | Comment |
---|---|---|---|---|---|
ΔrH° | 42.3 | kJ/mol | PHPMS | Grimsrud and Kebarle, 1973 | gas phase; M |
Quantity | Value | Units | Method | Reference | Comment |
ΔrS° | 117. | J/mol*K | PHPMS | Grimsrud and Kebarle, 1973 | gas phase; M |
By formula: CH6N+ + C2H6O = (CH6N+ • C2H6O)
Bond type: Hydrogen bonds of the type NH+-O between organics
Quantity | Value | Units | Method | Reference | Comment |
---|---|---|---|---|---|
ΔrH° | 90.0 | kJ/mol | PHPMS | Meot-Ner, 1984 | gas phase; M |
Quantity | Value | Units | Method | Reference | Comment |
ΔrS° | 123. | J/mol*K | PHPMS | Meot-Ner, 1984 | gas phase; M |
By formula: (Li+ • 2C2H6O) + C2H6O = (Li+ • 3C2H6O)
Quantity | Value | Units | Method | Reference | Comment |
---|---|---|---|---|---|
ΔrH° | 89.1 ± 7.9 | kJ/mol | CIDT | Rodgers and Armentrout, 2000 | RCD |
Enthalpy of reaction
ΔrH° (kJ/mol) | T (K) | Method | Reference | Comment |
---|---|---|---|---|
110. (+5.9,-0.) | CID | More, Gledening, et al., 1996 | gas phase; guided ion beam CID; M |
By formula: (Li+ • 3C2H6O) + C2H6O = (Li+ • 4C2H6O)
Quantity | Value | Units | Method | Reference | Comment |
---|---|---|---|---|---|
ΔrH° | 68. ± 10. | kJ/mol | CIDT | Rodgers and Armentrout, 2000 | RCD |
Enthalpy of reaction
ΔrH° (kJ/mol) | T (K) | Method | Reference | Comment |
---|---|---|---|---|
95.4 (+6.7,-0.) | CID | More, Gledening, et al., 1996 | gas phase; guided ion beam CID; M |
By formula: (Li+ • C2H6O) + C2H6O = (Li+ • 2C2H6O)
Quantity | Value | Units | Method | Reference | Comment |
---|---|---|---|---|---|
ΔrH° | 121. ± 5.9 | kJ/mol | CIDT | Rodgers and Armentrout, 2000 | RCD |
Enthalpy of reaction
ΔrH° (kJ/mol) | T (K) | Method | Reference | Comment |
---|---|---|---|---|
130. (+4.,-0.) | CID | More, Gledening, et al., 1996 | gas phase; guided ion beam CID; M |
+ = C2H6ClO-
By formula: Cl- + C2H6O = C2H6ClO-
Quantity | Value | Units | Method | Reference | Comment |
---|---|---|---|---|---|
ΔrH° | 31.4 ± 1.7 | kJ/mol | TDAs | Bogdanov, Lee, et al., 2001 | gas phase; B |
Quantity | Value | Units | Method | Reference | Comment |
ΔrG° | 12. ± 4.2 | kJ/mol | TDAs | Bogdanov, Lee, et al., 2001 | gas phase; B |
C2H5O- + =
By formula: C2H5O- + H+ = C2H6O
Quantity | Value | Units | Method | Reference | Comment |
---|---|---|---|---|---|
ΔrH° | 1703. ± 8.4 | kJ/mol | Bran | DePuy, Bierbaum, et al., 1984 | gas phase; B |
Quantity | Value | Units | Method | Reference | Comment |
ΔrG° | 1666. ± 9.2 | kJ/mol | H-TS | DePuy, Bierbaum, et al., 1984 | gas phase; B |
By formula: (Na+ • 2C2H6O) + C2H6O = (Na+ • 3C2H6O)
Quantity | Value | Units | Method | Reference | Comment |
---|---|---|---|---|---|
ΔrH° | 69.9 ± 5.0 | kJ/mol | CIDT | Rodgers and Armentrout, 2000 | RCD |
ΔrH° | 66.9 ± 5.0 | kJ/mol | CIDT | More, Ray, et al., 1997 | RCD |
By formula: (Na+ • 3C2H6O) + C2H6O = (Na+ • 4C2H6O)
Quantity | Value | Units | Method | Reference | Comment |
---|---|---|---|---|---|
ΔrH° | 61.1 ± 4.2 | kJ/mol | CIDT | Rodgers and Armentrout, 2000 | RCD |
ΔrH° | 58.2 ± 4.2 | kJ/mol | CIDT | More, Ray, et al., 1997 | RCD |
By formula: (K+ • 2C2H6O) + C2H6O = (K+ • 3C2H6O)
Quantity | Value | Units | Method | Reference | Comment |
---|---|---|---|---|---|
ΔrH° | 56.9 ± 4.2 | kJ/mol | CIDT | Rodgers and Armentrout, 2000 | RCD |
By formula: (K+ • 3C2H6O) + C2H6O = (K+ • 4C2H6O)
Quantity | Value | Units | Method | Reference | Comment |
---|---|---|---|---|---|
ΔrH° | 50.2 ± 7.9 | kJ/mol | CIDT | Rodgers and Armentrout, 2000 | RCD |
By formula: (Cs+ • 2C2H6O) + C2H6O = (Cs+ • 3C2H6O)
Quantity | Value | Units | Method | Reference | Comment |
---|---|---|---|---|---|
ΔrH° | 40. ± 9.2 | kJ/mol | CIDT | Rodgers and Armentrout, 2000 | RCD |
By formula: (Cs+ • C2H6O) + C2H6O = (Cs+ • 2C2H6O)
Quantity | Value | Units | Method | Reference | Comment |
---|---|---|---|---|---|
ΔrH° | 46.9 ± 5.9 | kJ/mol | CIDT | Rodgers and Armentrout, 2000 | RCD |
By formula: (Rb+ • 2C2H6O) + C2H6O = (Rb+ • 3C2H6O)
Quantity | Value | Units | Method | Reference | Comment |
---|---|---|---|---|---|
ΔrH° | 37. ± 11. | kJ/mol | CIDT | Rodgers and Armentrout, 2000 | RCD |
By formula: (Rb+ • C2H6O) + C2H6O = (Rb+ • 2C2H6O)
Quantity | Value | Units | Method | Reference | Comment |
---|---|---|---|---|---|
ΔrH° | 54.8 ± 5.0 | kJ/mol | CIDT | Rodgers and Armentrout, 2000 | RCD |
By formula: (K+ • C2H6O) + C2H6O = (K+ • 2C2H6O)
Quantity | Value | Units | Method | Reference | Comment |
---|---|---|---|---|---|
ΔrH° | 69.0 ± 5.0 | kJ/mol | CIDT | Rodgers and Armentrout, 2000 | RCD |
By formula: (Cu+ • 2C2H6O) + C2H6O = (Cu+ • 3C2H6O)
Quantity | Value | Units | Method | Reference | Comment |
---|---|---|---|---|---|
ΔrH° | 54.8 ± 4.2 | kJ/mol | CIDT | Koizumi, 2001 | RCD |
By formula: (Cu+ • 3C2H6O) + C2H6O = (Cu+ • 4C2H6O)
Quantity | Value | Units | Method | Reference | Comment |
---|---|---|---|---|---|
ΔrH° | 45. ± 10. | kJ/mol | CIDT | Koizumi, 2001 | RCD |
By formula: (Cu+ • C2H6O) + C2H6O = (Cu+ • 2C2H6O)
Quantity | Value | Units | Method | Reference | Comment |
---|---|---|---|---|---|
ΔrH° | 193. ± 7.9 | kJ/mol | CIDT | Koizumi, 2001 | RCD |
By formula: Cs+ + C2H6O = (Cs+ • C2H6O)
Quantity | Value | Units | Method | Reference | Comment |
---|---|---|---|---|---|
ΔrH° | 56.9 ± 5.0 | kJ/mol | CIDT | Rodgers and Armentrout, 2000 | RCD |
By formula: Rb+ + C2H6O = (Rb+ • C2H6O)
Quantity | Value | Units | Method | Reference | Comment |
---|---|---|---|---|---|
ΔrH° | 61.9 ± 9.2 | kJ/mol | CIDT | Rodgers and Armentrout, 2000 | RCD |

Ion clustering data

Data compiled as indicated in comments:
M - Michael M. Meot-Ner (Mautner) and Sharon G. Lias
B - John E. Bartmess
RCD - Robert C. Dunbar
Clustering reactions
By formula: (CH5O+ • CH4O) + C2H6O = (CH5O+ • C2H6O • CH4O)
Bond type: Hydrogen bonds of the type OH-O between organics
Quantity | Value | Units | Method | Reference | Comment |
---|---|---|---|---|---|
ΔrH° | 91.6 | kJ/mol | PHPMS | Hiraoka, Grimsrud, et al., 1974 | gas phase; n, note proton affinities, core ion may be (CH3)2OH+; M |
Quantity | Value | Units | Method | Reference | Comment |
ΔrS° | 105. | J/mol*K | PHPMS | Hiraoka, Grimsrud, et al., 1974 | gas phase; n, note proton affinities, core ion may be (CH3)2OH+; M |
By formula: (CH5O+ • 2CH4O) + C2H6O = (CH5O+ • C2H6O • 2CH4O)
Bond type: Hydrogen bonds of the type OH-O between organics
Quantity | Value | Units | Method | Reference | Comment |
---|---|---|---|---|---|
ΔrH° | 72.0 | kJ/mol | PHPMS | Hiraoka, Grimsrud, et al., 1974 | gas phase; n, note proton affinities, core ion may be (CH3)2OH+; M |
Quantity | Value | Units | Method | Reference | Comment |
ΔrS° | 120. | J/mol*K | PHPMS | Hiraoka, Grimsrud, et al., 1974 | gas phase; n, note proton affinities, core ion may be (CH3)2OH+; M |
By formula: (CH5O+ • 3CH4O) + C2H6O = (CH5O+ • C2H6O • 3CH4O)
Bond type: Hydrogen bonds of the type OH-O between organics
Quantity | Value | Units | Method | Reference | Comment |
---|---|---|---|---|---|
ΔrH° | 57.3 | kJ/mol | PHPMS | Hiraoka, Grimsrud, et al., 1974 | gas phase; n, note proton affinities, core ion may be (CH3)2OH+; M |
Quantity | Value | Units | Method | Reference | Comment |
ΔrS° | 129. | J/mol*K | PHPMS | Hiraoka, Grimsrud, et al., 1974 | gas phase; n, note proton affinities, core ion may be (CH3)2OH+; M |
By formula: CH5O+ + C2H6O = (CH5O+ • C2H6O)
Bond type: Hydrogen bonds of the type OH-O between organics
Quantity | Value | Units | Method | Reference | Comment |
---|---|---|---|---|---|
ΔrH° | 146. | kJ/mol | PHPMS | Hiraoka, Grimsrud, et al., 1974 | gas phase; n, note proton affinities, core ion may be ((CH3)2OH+; M |
Quantity | Value | Units | Method | Reference | Comment |
ΔrS° | 103. | J/mol*K | PHPMS | Hiraoka, Grimsrud, et al., 1974 | gas phase; n, note proton affinities, core ion may be ((CH3)2OH+; M |
By formula: CH6N+ + C2H6O = (CH6N+ • C2H6O)
Bond type: Hydrogen bonds of the type NH+-O between organics
Quantity | Value | Units | Method | Reference | Comment |
---|---|---|---|---|---|
ΔrH° | 90.0 | kJ/mol | PHPMS | Meot-Ner, 1984 | gas phase; M |
Quantity | Value | Units | Method | Reference | Comment |
ΔrS° | 123. | J/mol*K | PHPMS | Meot-Ner, 1984 | gas phase; M |
By formula: (C2H7O+ • CH4O) + C2H6O = (C2H7O+ • C2H6O • CH4O)
Bond type: Hydrogen bonds of the type OH-O between organics
Quantity | Value | Units | Method | Reference | Comment |
---|---|---|---|---|---|
ΔrH° | 84.5 | kJ/mol | PHPMS | Hiraoka, Grimsrud, et al., 1974 | gas phase; n; M |
Quantity | Value | Units | Method | Reference | Comment |
ΔrS° | 125. | J/mol*K | PHPMS | Hiraoka, Grimsrud, et al., 1974 | gas phase; n; M |
(C2H7O+ • 2) + = (C2H7O+ • • 2)
By formula: (C2H7O+ • 2CH4O) + C2H6O = (C2H7O+ • C2H6O • 2CH4O)
Bond type: Hydrogen bonds of the type OH-O between organics
Quantity | Value | Units | Method | Reference | Comment |
---|---|---|---|---|---|
ΔrH° | 69.5 | kJ/mol | PHPMS | Hiraoka, Grimsrud, et al., 1974 | gas phase; n; M |
Quantity | Value | Units | Method | Reference | Comment |
ΔrS° | 133. | J/mol*K | PHPMS | Hiraoka, Grimsrud, et al., 1974 | gas phase; n; M |
(C2H7O+ • 3) + = (C2H7O+ • • 3)
By formula: (C2H7O+ • 3CH4O) + C2H6O = (C2H7O+ • C2H6O • 3CH4O)
Bond type: Hydrogen bonds of the type OH-O between organics
Quantity | Value | Units | Method | Reference | Comment |
---|---|---|---|---|---|
ΔrH° | 52.3 | kJ/mol | PHPMS | Hiraoka, Grimsrud, et al., 1974 | gas phase; n; M |
Quantity | Value | Units | Method | Reference | Comment |
ΔrS° | 107. | J/mol*K | PHPMS | Hiraoka, Grimsrud, et al., 1974 | gas phase; n; M |
By formula: C2H7O+ + C2H6O = (C2H7O+ • C2H6O)
Bond type: Hydrogen bonds of the type OH-O between organics
Quantity | Value | Units | Method | Reference | Comment |
---|---|---|---|---|---|
ΔrH° | 134. | kJ/mol | PHPMS | Meot-Ner (Mautner) and Sieck, 1991 | gas phase; M |
ΔrH° | 128. | kJ/mol | PHPMS | Grimsrud and Kebarle, 1973 | gas phase; M |
Quantity | Value | Units | Method | Reference | Comment |
ΔrS° | 133. | J/mol*K | PHPMS | Meot-Ner (Mautner) and Sieck, 1991 | gas phase; M |
ΔrS° | 124. | J/mol*K | PHPMS | Grimsrud and Kebarle, 1973 | gas phase; M |
By formula: (C2H7O+ • C2H6O) + C2H6O = (C2H7O+ • 2C2H6O)
Bond type: Hydrogen bonds of the type OH-O between organics
Quantity | Value | Units | Method | Reference | Comment |
---|---|---|---|---|---|
ΔrH° | 42.3 | kJ/mol | PHPMS | Grimsrud and Kebarle, 1973 | gas phase; M |
Quantity | Value | Units | Method | Reference | Comment |
ΔrS° | 117. | J/mol*K | PHPMS | Grimsrud and Kebarle, 1973 | gas phase; M |
(C2H7O+ • • ) + = (C2H7O+ • 2 • )
By formula: (C2H7O+ • C2H6O • H2O) + C2H6O = (C2H7O+ • 2C2H6O • H2O)
Bond type: Hydrogen bonds of the type OH-O between organics
Quantity | Value | Units | Method | Reference | Comment |
---|---|---|---|---|---|
ΔrH° | 70.3 | kJ/mol | PHPMS | Hiraoka, Grimsrud, et al., 1974 | gas phase; n; M |
Quantity | Value | Units | Method | Reference | Comment |
ΔrS° | 111. | J/mol*K | PHPMS | Hiraoka, Grimsrud, et al., 1974 | gas phase; n; M |
(C2H7O+ • • 2) + = (C2H7O+ • 2 • 2)
By formula: (C2H7O+ • C2H6O • 2H2O) + C2H6O = (C2H7O+ • 2C2H6O • 2H2O)
Bond type: Hydrogen bonds of the type OH-O between organics
Quantity | Value | Units | Method | Reference | Comment |
---|---|---|---|---|---|
ΔrH° | 66.1 | kJ/mol | PHPMS | Hiraoka, Grimsrud, et al., 1974 | gas phase; n, Entropy change is questionable; M |
Quantity | Value | Units | Method | Reference | Comment |
ΔrS° | 153. | J/mol*K | PHPMS | Hiraoka, Grimsrud, et al., 1974 | gas phase; n, Entropy change is questionable; M |
(C2H7O+ • 2 • ) + = (C2H7O+ • 3 • )
By formula: (C2H7O+ • 2C2H6O • H2O) + C2H6O = (C2H7O+ • 3C2H6O • H2O)
Bond type: Hydrogen bonds between protonated and neutral organics
Quantity | Value | Units | Method | Reference | Comment |
---|---|---|---|---|---|
ΔrH° | 90.8 | kJ/mol | PHPMS | Tholman, Tonner, et al., 1994 | gas phase; M |
Quantity | Value | Units | Method | Reference | Comment |
ΔrS° | 174. | J/mol*K | PHPMS | Tholman, Tonner, et al., 1994 | gas phase; M |
By formula: (C2H7O+ • H2O) + C2H6O = (C2H7O+ • C2H6O • H2O)
Bond type: Hydrogen bonds of the type OH-O between organics
Quantity | Value | Units | Method | Reference | Comment |
---|---|---|---|---|---|
ΔrH° | 77.4 | kJ/mol | PHPMS | Hiraoka, Grimsrud, et al., 1974 | gas phase; n; M |
Quantity | Value | Units | Method | Reference | Comment |
ΔrS° | 110. | J/mol*K | PHPMS | Hiraoka, Grimsrud, et al., 1974 | gas phase; n; M |
(C2H7O+ • 2) + = (C2H7O+ • • 2)
By formula: (C2H7O+ • 2H2O) + C2H6O = (C2H7O+ • C2H6O • 2H2O)
Bond type: Hydrogen bonds of the type OH-O between organics
Quantity | Value | Units | Method | Reference | Comment |
---|---|---|---|---|---|
ΔrH° | 68.6 | kJ/mol | PHPMS | Hiraoka, Grimsrud, et al., 1974 | gas phase; n; M |
Quantity | Value | Units | Method | Reference | Comment |
ΔrS° | 95.4 | J/mol*K | PHPMS | Hiraoka, Grimsrud, et al., 1974 | gas phase; n; M |
(C2H7O+ • 3) + = (C2H7O+ • • 3)
By formula: (C2H7O+ • 3H2O) + C2H6O = (C2H7O+ • C2H6O • 3H2O)
Bond type: Hydrogen bonds of the type OH-O between organics
Quantity | Value | Units | Method | Reference | Comment |
---|---|---|---|---|---|
ΔrH° | 70.7 | kJ/mol | PHPMS | Hiraoka, Grimsrud, et al., 1974 | gas phase; n; M |
Quantity | Value | Units | Method | Reference | Comment |
ΔrS° | 138. | J/mol*K | PHPMS | Hiraoka, Grimsrud, et al., 1974 | gas phase; n; M |
By formula: C3H7O2+ + C2H6O = (C3H7O2+ • C2H6O)
Bond type: Hydrogen bonds of the type OH-O between organics
Quantity | Value | Units | Method | Reference | Comment |
---|---|---|---|---|---|
ΔrH° | 126. | kJ/mol | ICR | Larson and McMahon, 1982 | gas phase; switching reaction((CH3)2OH+)(CH3)2O, Entropy change calculated or estimated; Grimsrud and Kebarle, 1973, Lias, Liebman, et al., 1984, Keesee and Castleman, 1986; M |
Quantity | Value | Units | Method | Reference | Comment |
ΔrS° | 120. | J/mol*K | N/A | Larson and McMahon, 1982 | gas phase; switching reaction((CH3)2OH+)(CH3)2O, Entropy change calculated or estimated; Grimsrud and Kebarle, 1973, Lias, Liebman, et al., 1984, Keesee and Castleman, 1986; M |
Quantity | Value | Units | Method | Reference | Comment |
ΔrG° | 90.4 | kJ/mol | ICR | Larson and McMahon, 1982 | gas phase; switching reaction((CH3)2OH+)(CH3)2O, Entropy change calculated or estimated; Grimsrud and Kebarle, 1973, Lias, Liebman, et al., 1984, Keesee and Castleman, 1986; M |
By formula: C4H9O2+ + C2H6O = (C4H9O2+ • C2H6O)
Bond type: Hydrogen bonds of the type OH-O between organics
Quantity | Value | Units | Method | Reference | Comment |
---|---|---|---|---|---|
ΔrH° | 125. | kJ/mol | ICR | Larson and McMahon, 1982 | gas phase; switching reaction((CH3)2OH+)(CH3)2O, Entropy change calculated or estimated; Grimsrud and Kebarle, 1973, Lias, Liebman, et al., 1984, Keesee and Castleman, 1986; M |
Quantity | Value | Units | Method | Reference | Comment |
ΔrS° | 122. | J/mol*K | N/A | Larson and McMahon, 1982 | gas phase; switching reaction((CH3)2OH+)(CH3)2O, Entropy change calculated or estimated; Grimsrud and Kebarle, 1973, Lias, Liebman, et al., 1984, Keesee and Castleman, 1986; M |
Quantity | Value | Units | Method | Reference | Comment |
ΔrG° | 88.7 | kJ/mol | ICR | Larson and McMahon, 1982 | gas phase; switching reaction((CH3)2OH+)(CH3)2O, Entropy change calculated or estimated; Grimsrud and Kebarle, 1973, Lias, Liebman, et al., 1984, Keesee and Castleman, 1986; M |
By formula: C10H10Fe+ + C2H6O = (C10H10Fe+ • C2H6O)
Quantity | Value | Units | Method | Reference | Comment |
---|---|---|---|---|---|
ΔrH° | 40. | kJ/mol | PHPMS | Meot-Ner (Mautner), 1989 | gas phase; Entropy change calculated or estimated, ΔrH<, DG<; M |
Quantity | Value | Units | Method | Reference | Comment |
ΔrS° | 84. | J/mol*K | N/A | Meot-Ner (Mautner), 1989 | gas phase; Entropy change calculated or estimated, ΔrH<, DG<; M |
Free energy of reaction
ΔrG° (kJ/mol) | T (K) | Method | Reference | Comment |
---|---|---|---|---|
15. | 250. | PHPMS | Meot-Ner (Mautner), 1989 | gas phase; Entropy change calculated or estimated, ΔrH<, DG<; M |
+ = C2H6ClO-
By formula: Cl- + C2H6O = C2H6ClO-
Quantity | Value | Units | Method | Reference | Comment |
---|---|---|---|---|---|
ΔrH° | 31.4 ± 1.7 | kJ/mol | TDAs | Bogdanov, Lee, et al., 2001 | gas phase; B |
Quantity | Value | Units | Method | Reference | Comment |
ΔrG° | 12. ± 4.2 | kJ/mol | TDAs | Bogdanov, Lee, et al., 2001 | gas phase; B |
By formula: Cs+ + C2H6O = (Cs+ • C2H6O)
Quantity | Value | Units | Method | Reference | Comment |
---|---|---|---|---|---|
ΔrH° | 56.9 ± 5.0 | kJ/mol | CIDT | Rodgers and Armentrout, 2000 | RCD |
By formula: (Cs+ • C2H6O) + C2H6O = (Cs+ • 2C2H6O)
Quantity | Value | Units | Method | Reference | Comment |
---|---|---|---|---|---|
ΔrH° | 46.9 ± 5.9 | kJ/mol | CIDT | Rodgers and Armentrout, 2000 | RCD |
By formula: (Cs+ • 2C2H6O) + C2H6O = (Cs+ • 3C2H6O)
Quantity | Value | Units | Method | Reference | Comment |
---|---|---|---|---|---|
ΔrH° | 40. ± 9.2 | kJ/mol | CIDT | Rodgers and Armentrout, 2000 | RCD |
By formula: Cu+ + C2H6O = (Cu+ • C2H6O)
Quantity | Value | Units | Method | Reference | Comment |
---|---|---|---|---|---|
ΔrH° | 185. ± 12. | kJ/mol | CIDT | Koizumi, 2001 | RCD |
By formula: (Cu+ • C2H6O) + C2H6O = (Cu+ • 2C2H6O)
Quantity | Value | Units | Method | Reference | Comment |
---|---|---|---|---|---|
ΔrH° | 193. ± 7.9 | kJ/mol | CIDT | Koizumi, 2001 | RCD |
By formula: (Cu+ • 2C2H6O) + C2H6O = (Cu+ • 3C2H6O)
Quantity | Value | Units | Method | Reference | Comment |
---|---|---|---|---|---|
ΔrH° | 54.8 ± 4.2 | kJ/mol | CIDT | Koizumi, 2001 | RCD |
By formula: (Cu+ • 3C2H6O) + C2H6O = (Cu+ • 4C2H6O)
Quantity | Value | Units | Method | Reference | Comment |
---|---|---|---|---|---|
ΔrH° | 45. ± 10. | kJ/mol | CIDT | Koizumi, 2001 | RCD |
By formula: K+ + C2H6O = (K+ • C2H6O)
Quantity | Value | Units | Method | Reference | Comment |
---|---|---|---|---|---|
ΔrH° | 72.8 ± 4.2 | kJ/mol | CIDT | Rodgers and Armentrout, 2000 | RCD |
ΔrH° | 92.9 | kJ/mol | HPMS | Davidson and Kebarle, 1976 | gas phase; M |
ΔrH° | 87.0 | kJ/mol | HPMS | Davidson and Kebarle, 1976, 2 | gas phase; M |
Quantity | Value | Units | Method | Reference | Comment |
ΔrS° | 112. | J/mol*K | HPMS | Davidson and Kebarle, 1976 | gas phase; M |
ΔrS° | 104. | J/mol*K | HPMS | Davidson and Kebarle, 1976, 2 | gas phase; M |
By formula: (K+ • C2H6O) + C2H6O = (K+ • 2C2H6O)
Quantity | Value | Units | Method | Reference | Comment |
---|---|---|---|---|---|
ΔrH° | 69.0 ± 5.0 | kJ/mol | CIDT | Rodgers and Armentrout, 2000 | RCD |
By formula: (K+ • 2C2H6O) + C2H6O = (K+ • 3C2H6O)
Quantity | Value | Units | Method | Reference | Comment |
---|---|---|---|---|---|
ΔrH° | 56.9 ± 4.2 | kJ/mol | CIDT | Rodgers and Armentrout, 2000 | RCD |
By formula: (K+ • 3C2H6O) + C2H6O = (K+ • 4C2H6O)
Quantity | Value | Units | Method | Reference | Comment |
---|---|---|---|---|---|
ΔrH° | 50.2 ± 7.9 | kJ/mol | CIDT | Rodgers and Armentrout, 2000 | RCD |
By formula: Li+ + C2H6O = (Li+ • C2H6O)
Quantity | Value | Units | Method | Reference | Comment |
---|---|---|---|---|---|
ΔrH° | 165. ± 11. | kJ/mol | CIDT | Rodgers and Armentrout, 2000 | RCD |
ΔrH° | 165. | kJ/mol | ICR | Woodin and Beauchamp, 1978 | gas phase; switching reaction(Li+)H2O, Entropy change calculated or estimated; Dzidic and Kebarle, 1970 extrapolated; M |
ΔrH° | 160. | kJ/mol | ICR | Staley and Beauchamp, 1975 | gas phase; switching reaction(Li+)H2O, from graph; Dzidic and Kebarle, 1970 extrapolated; M |
Quantity | Value | Units | Method | Reference | Comment |
ΔrS° | 110. | J/mol*K | N/A | Woodin and Beauchamp, 1978 | gas phase; switching reaction(Li+)H2O, Entropy change calculated or estimated; Dzidic and Kebarle, 1970 extrapolated; M |
Quantity | Value | Units | Method | Reference | Comment |
ΔrG° | 131. | kJ/mol | ICR | Woodin and Beauchamp, 1978 | gas phase; switching reaction(Li+)H2O, Entropy change calculated or estimated; Dzidic and Kebarle, 1970 extrapolated; M |
Enthalpy of reaction
ΔrH° (kJ/mol) | T (K) | Method | Reference | Comment |
---|---|---|---|---|
165. (+10.,-0.) | CID | More, Gledening, et al., 1996 | gas phase; guided ion beam CID; M |
By formula: (Li+ • C2H6O) + C2H6O = (Li+ • 2C2H6O)
Quantity | Value | Units | Method | Reference | Comment |
---|---|---|---|---|---|
ΔrH° | 121. ± 5.9 | kJ/mol | CIDT | Rodgers and Armentrout, 2000 | RCD |
Enthalpy of reaction
ΔrH° (kJ/mol) | T (K) | Method | Reference | Comment |
---|---|---|---|---|
130. (+4.,-0.) | CID | More, Gledening, et al., 1996 | gas phase; guided ion beam CID; M |
By formula: (Li+ • 2C2H6O) + C2H6O = (Li+ • 3C2H6O)
Quantity | Value | Units | Method | Reference | Comment |
---|---|---|---|---|---|
ΔrH° | 89.1 ± 7.9 | kJ/mol | CIDT | Rodgers and Armentrout, 2000 | RCD |
Enthalpy of reaction
ΔrH° (kJ/mol) | T (K) | Method | Reference | Comment |
---|---|---|---|---|
110. (+5.9,-0.) | CID | More, Gledening, et al., 1996 | gas phase; guided ion beam CID; M |
By formula: (Li+ • 3C2H6O) + C2H6O = (Li+ • 4C2H6O)
Quantity | Value | Units | Method | Reference | Comment |
---|---|---|---|---|---|
ΔrH° | 68. ± 10. | kJ/mol | CIDT | Rodgers and Armentrout, 2000 | RCD |
Enthalpy of reaction
ΔrH° (kJ/mol) | T (K) | Method | Reference | Comment |
---|---|---|---|---|
95.4 (+6.7,-0.) | CID | More, Gledening, et al., 1996 | gas phase; guided ion beam CID; M |
By formula: Na+ + C2H6O = (Na+ • C2H6O)
Quantity | Value | Units | Method | Reference | Comment |
---|---|---|---|---|---|
ΔrH° | 100. ± 5.4 | kJ/mol | CIDC | Amicangelo and Armentrout, 2001 | Anchor NH3=24.41; RCD |
ΔrH° | 91.6 ± 4.6 | kJ/mol | CIDT | Armentrout and Rodgers, 2000 | RCD |
ΔrH° | 92.0 ± 5.0 | kJ/mol | CIDT | Rodgers and Armentrout, 2000 | RCD |
ΔrH° | 92.9 ± 5.0 | kJ/mol | CIDT | More, Ray, et al., 1997 | RCD |
Free energy of reaction
ΔrG° (kJ/mol) | T (K) | Method | Reference | Comment |
---|---|---|---|---|
73.6 | 298. | IMRE | McMahon and Ohanessian, 2000 | Anchor alanine=39.89; RCD |
73.6 | 298. | CIDC | McMahon and Ohanessian, 2000 | RCD |
By formula: (Na+ • C2H6O) + C2H6O = (Na+ • 2C2H6O)
Quantity | Value | Units | Method | Reference | Comment |
---|---|---|---|---|---|
ΔrH° | 85. ± 7. | kJ/mol | AVG | N/A | Average of 7 values; Individual data points |
By formula: (Na+ • 2C2H6O) + C2H6O = (Na+ • 3C2H6O)
Quantity | Value | Units | Method | Reference | Comment |
---|---|---|---|---|---|
ΔrH° | 69.9 ± 5.0 | kJ/mol | CIDT | Rodgers and Armentrout, 2000 | RCD |
ΔrH° | 66.9 ± 5.0 | kJ/mol | CIDT | More, Ray, et al., 1997 | RCD |
By formula: (Na+ • 3C2H6O) + C2H6O = (Na+ • 4C2H6O)
Quantity | Value | Units | Method | Reference | Comment |
---|---|---|---|---|---|
ΔrH° | 61.1 ± 4.2 | kJ/mol | CIDT | Rodgers and Armentrout, 2000 | RCD |
ΔrH° | 58.2 ± 4.2 | kJ/mol | CIDT | More, Ray, et al., 1997 | RCD |
By formula: Rb+ + C2H6O = (Rb+ • C2H6O)
Quantity | Value | Units | Method | Reference | Comment |
---|---|---|---|---|---|
ΔrH° | 61.9 ± 9.2 | kJ/mol | CIDT | Rodgers and Armentrout, 2000 | RCD |
By formula: (Rb+ • C2H6O) + C2H6O = (Rb+ • 2C2H6O)
Quantity | Value | Units | Method | Reference | Comment |
---|---|---|---|---|---|
ΔrH° | 54.8 ± 5.0 | kJ/mol | CIDT | Rodgers and Armentrout, 2000 | RCD |
By formula: (Rb+ • 2C2H6O) + C2H6O = (Rb+ • 3C2H6O)
Quantity | Value | Units | Method | Reference | Comment |
---|---|---|---|---|---|
ΔrH° | 37. ± 11. | kJ/mol | CIDT | Rodgers and Armentrout, 2000 | RCD |

Henry's Law data

Data compiled by: Rolf Sander
Henry's Law constant (water solution)
kH(T) = k°H exp(d(ln(kH))/d(1/T) ((1/T) - 1/(298.15 K)))
k°H = Henry's law constant for solubility in water at 298.15 K (mol/(kg*bar))
d(ln(kH))/d(1/T) = Temperature dependence constant (K)
k°H (mol/(kg*bar)) | d(ln(kH))/d(1/T) (K) | Method | Reference |
---|---|---|---|
1.0 | V | N/A | |
0.99 | R | N/A |

Gas phase ion energetics data

Data evaluated as indicated in comments:
HL - Edward P. Hunter and Sharon G. Lias
L - Sharon G. Lias
Data compiled as indicated in comments:
B - John E. Bartmess
LBLHLM - Sharon G. Lias, John E. Bartmess, Joel F. Liebman, John L. Holmes, Rhoda D. Levin, and W. Gary Mallard
LLK - Sharon G. Lias, Rhoda D. Levin, and Sherif A. Kafafi
RDSH - Henry M. Rosenstock, Keith Draxl, Bruce W. Steiner, and John T. Herron
Quantity | Value | Units | Method | Reference | Comment |
---|---|---|---|---|---|
IE (evaluated) | 10.025 ± 0.025 | eV | N/A | N/A | L |
Quantity | Value | Units | Method | Reference | Comment |
Proton affinity (review) | 792. | kJ/mol | N/A | Hunter and Lias, 1998 | HL |
Quantity | Value | Units | Method | Reference | Comment |
Gas basicity | 764.5 | kJ/mol | N/A | Hunter and Lias, 1998 | HL |
Ionization energy determinations
IE (eV) | Method | Reference | Comment |
---|---|---|---|
10.025 ± 0.025 | PIPECO | Butler, Holland, et al., 1984 | LBLHLM |
9.95 ± 0.07 | EI | Bowen and Maccoll, 1984 | LBLHLM |
10.04 | PE | Kimura, Katsumata, et al., 1981 | LLK |
9.8 ± 0.1 | PE | Aue, Webb, et al., 1980 | LLK |
9.8 | PE | Aue and Bowers, 1979 | LLK |
10.01 ± 0.01 | PI | Botter, Pechine, et al., 1977 | LLK |
9.94 ± 0.01 | PE | Cocksey, Eland, et al., 1971 | LLK |
10.1 ± 0.2 | EI | Ivko, 1970 | RDSH |
9.94 | PE | Dewar and Worley, 1969 | RDSH |
9.96 ± 0.05 | S | Hernandez, 1963 | RDSH |
10.00 ± 0.02 | PI | Watanabe, 1957 | RDSH |
10.0 | PE | Bajic, Humski, et al., 1985 | Vertical value; LBLHLM |
10.1 | PE | Bieri, Asbrink, et al., 1982 | Vertical value; LBLHLM |
11.94 | PE | Utsunomiya, Kobayashi, et al., 1980 | Vertical value; LLK |
10.0 ± 0.2 | PE | Carnovale, Livett, et al., 1980 | Vertical value; LLK |
10.1 | PE | Aue and Bowers, 1979 | Vertical value; LLK |
10.03 | PE | Kobayashi, 1978 | Vertical value; LLK |
9.98 | PE | Benoit and Harrison, 1977 | Vertical value; LLK |
10.052 | PE | Aue, Webb, et al., 1975 | Vertical value; LLK |
10.04 | PE | Bock, Mollere, et al., 1973 | Vertical value; LLK |
10.04 | PE | Cradock and Whiteford, 1972 | Vertical value; LLK |
Appearance energy determinations
Ion | AE (eV) | Other Products | Method | Reference | Comment |
---|---|---|---|---|---|
CHO+ | ≤12.85 ± 0.10 | H2+CH3 | PIPECO | Butler, Holland, et al., 1984 | T = 298K; LBLHLM |
CHO+ | 14.0 ± 0.2 | ? | EI | Ivko, 1970 | RDSH |
CH3+ | ≤14.4 ± 0.1 | CH2O+H | PIPECO | Butler, Holland, et al., 1984 | T = 298K; LBLHLM |
CH3+ | 14.93 ± 0.13 | ? | EI | Haney and Franklin, 1969 | RDSH |
CH3O+ | ≤11.85 ± 0.10 | CH3 | PIPECO | Butler, Holland, et al., 1984 | T = 298K; LBLHLM |
CH3O+ | ≤11.8 | CH3 | EI | Lossing, 1977 | LLK |
CH3O+ | 12.4 ± 0.1 | CH3 | EI | Ivko, 1970 | RDSH |
CH3O+ | 11.95 ± 0.05 | CH3 | EI | Haney and Franklin, 1969 | RDSH |
C2H5O+ | 11.115 ± 0.010 | H | PIPECO | Butler, Holland, et al., 1984 | T = 0K; LBLHLM |
C2H5O+ | 10.99 ± 0.08 | H | EI | Bowen and Maccoll, 1984 | LBLHLM |
C2H5O+ | 10.99 | H | EI | Lossing, 1977 | LLK |
C2H5O+ | 11.23 ± 0.04 | H | EI | Solka and Russell, 1974 | LLK |
C2H5O+ | 10.70 ± 0.13 | H | EI | Finney and Harrison, 1972 | LLK |
C2H5O+ | 11.55 ± 0.15 | H | EI | Ivko, 1970 | RDSH |
C2H5O+ | 11.42 ± 0.01 | H | EI | Martin, Lampe, et al., 1966 | RDSH |
De-protonation reactions
C2H5O- + =
By formula: C2H5O- + H+ = C2H6O
Quantity | Value | Units | Method | Reference | Comment |
---|---|---|---|---|---|
ΔrH° | 1703. ± 8.4 | kJ/mol | Bran | DePuy, Bierbaum, et al., 1984 | gas phase; B |
Quantity | Value | Units | Method | Reference | Comment |
ΔrG° | 1666. ± 9.2 | kJ/mol | H-TS | DePuy, Bierbaum, et al., 1984 | gas phase; B |

Vibrational and/or electronic energy levels

Data compiled by: Takehiko Shimanouchi
Symmetry: C2ν Symmetry Number σ = 2
Sym. | No | Approximate | Selected Freq. | Infrared | Raman | Comments | ||||
---|---|---|---|---|---|---|---|---|---|---|
Species | type of mode | Value | Rating | Value | Phase | Value | Phase | |||
a1 | 1 | CH3 d-str | 2996 | B | 2996 S | gas | 2989 S | liq. | ||
a1 | 2 | CH3 s-str | 2817 | B | 2817 S | gas | 2815 VS p | liq. | ||
a1 | 3 | CH3 d-deform | 1464 | D | 1464 M | gas | ||||
a1 | 4 | CH3 s-deform | 1452 | D | 1452 M | gas | 1452 S dp | liq. | ||
a1 | 5 | CH3 rock | 1244 | B | 1244 W | gas | ||||
a1 | 6 | CO s-str | 928 | B | 928 S | gas | 922 S p | liq. | ||
a1 | 7 | COC deform | 418 | C | 418 M | gas | 428 M p | liq. | ||
a2 | 8 | CH3 d-str | 2952 | C | ia | 2952 S | liq. | |||
a2 | 9 | CH3 d-deform | 1464 | D | ia | SF(ν3) | ||||
a2 | 10 | CH3 rock | 1150 | C | ia | 1150 M d | liq. | |||
a2 | 11 | Torsion | 203 | E | ia | CF | ||||
b1 | 12 | CH3 d-str | 2996 | B | 2996 S | gas | 2989 S | liq. | OV(ν1) | |
b1 | 13 | CH3 s-str | 2817 | B | 2817 S | gas | 2815 VS p | liq. | OV(ν2) | |
b1 | 14 | CH3 d-deform | 1464 | D | 1464 M | gas | OV(ν3) | |||
b1 | 15 | CH3 s-deform | 1452 | D | 1452 M | gas | 1452 S dp | liq. | OV(ν4) | |
b1 | 16 | CH3 rock | 1227 | C | 1227 W | liq. | ||||
b1 | 17 | CO a-str | 1102 | B | 1102 VS | gas | 1104 M dp | liq. | ||
b2 | 18 | CH3 d-str | 2925 | B | 2925 S | gas | ||||
b2 | 19 | CH3 d-deform | 1464 | D | 1464 M | gas | OV(ν3) | |||
b2 | 20 | CH3 rock | 1179 | B | 1179 VS | gas | 1170 sh | liq. | ||
b2 | 21 | Torsion | 242 | C | 242 W | gas | ||||
Source: Shimanouchi, 1972

Kovats' RI, non-polar column, isothermal

Column type | Active phase | Temperature (C) | I | Reference | Comment |
---|---|---|---|---|---|
Packed | Squalane | 50. | 323. | Becerra, Sánchez, et al., 1982 | N2, Chromosorb W-AM; Column length: 6. m |
Packed | Squalane | 50. | 325. | Becerra, Sánchez, et al., 1982 | N2, Chromosorb W-AM; Column length: 6. m |
Packed | Apiezon L | 120. | 324. | Bogoslovsky, Anvaer, et al., 1978 | Celite 545 |
Packed | Apiezon L | 160. | 331. | Bogoslovsky, Anvaer, et al., 1978 | Celite 545 |
Packed | Apiezon M | 130. | 323. | Golovnya and Garbuzov, 1974 | N2, Chromosorb W; Column length: 2.1 m |

Normal alkane RI, non-polar column, temperature ramp

Column type | Active phase | I | Reference | Comment |
---|---|---|---|---|
Capillary | OV-101 | 327. | Zenkevich, 2005 | 25. m/0.20 mm/0.10 μm, N2/He, 6. K/min; Tstart: 50. C; Tend: 250. C |

Normal alkane RI, non-polar column, custom temperature program

Column type | Active phase | I | Reference | Comment |
---|---|---|---|---|
Capillary | SE-30 | 350. | Vinogradov, 2004 | Program: not specified |
Capillary | SPB-1 | 328. | Flanagan, Streete, et al., 1997 | 60. m/0.53 mm/5. μm, He; Program: 40C(6min) => 5C/min => 80C => 10C/min => 200C |
Capillary | Polydimethyl siloxanes | 327. | Zenkevich and Chupalov, 1996 | Program: not specified |
Capillary | SPB-1 | 328. | Strete, Ruprah, et al., 1992 | 60. m/0.53 mm/5.0 μm, Helium; Program: 40 0C (6 min) 5 0C/min -> 80 0C 10 0C/min -> 200 0C |

Normal alkane RI, polar column, isothermal

Column type | Active phase | Temperature (C) | I | Reference | Comment |
---|---|---|---|---|---|
Capillary | Carbowax 20M | 60. | 478. | Sun, Siepmann, et al., 2006 | 30. m/0.25 mm/0.25 μm, Helium |
Capillary | Carbowax 20M | 80. | 481. | Sun, Siepmann, et al., 2006 | 30. m/0.25 mm/0.25 μm, Helium |

Normal alkane RI, polar column, custom temperature program

Column type | Active phase | I | Reference | Comment |
---|---|---|---|---|
Capillary | Carbowax 20M | 524. | Vinogradov, 2004 | Program: not specified |

Gas phase thermochemistry data

Data compiled as indicated in comments:
ALS - Hussein Y. Afeefy, Joel F. Liebman, and Stephen E. Stein
GT - Glushko Thermocenter, Russian Academy of Sciences, Moscow
Quantity | Value | Units | Method | Reference | Comment |
---|---|---|---|---|---|
ΔfH°gas | -43.99 ± 0.12 | kcal/mol | Ccb | Pilcher, Pell, et al., 1964 | ALS |
Quantity | Value | Units | Method | Reference | Comment |
ΔcH°gas | -349.04 ± 0.11 | kcal/mol | Ccb | Pilcher, Pell, et al., 1964 | Corresponding ΔfHºgas = -44.01 kcal/mol (simple calculation by NIST; no Washburn corrections); ALS |
Constant pressure heat capacity of gas
Cp,gas (cal/mol*K) | Temperature (K) | Reference | Comment |
---|---|---|---|
10.10 | 100. | Chao J., 1986 | p=1 bar. Selected values are in close agreement with other statistically calculated values [ Handi M.A., 1954, Seha Z., 1955, Banerjee S.C., 1964, Stull D.R., 1969] and ab initio result [ East A.L.L., 1997] at low temperatures. Discrepancies in S(1000 K) and Cp(1000 K) amount to about 5 and 3 J/mol*K, respectively, for [ Handi M.A., 1954, Banerjee S.C., 1964, Stull D.R., 1969].; GT |
11.71 | 150. | ||
13.02 | 200. | ||
14.95 | 273.15 | ||
15.67 ± 0.02 | 298.15 | ||
15.73 | 300. | ||
18.80 | 400. | ||
21.84 | 500. | ||
24.584 | 600. | ||
27.015 | 700. | ||
29.156 | 800. | ||
31.033 | 900. | ||
32.672 | 1000. | ||
34.104 | 1100. | ||
35.347 | 1200. | ||
36.427 | 1300. | ||
37.369 | 1400. | ||
38.186 | 1500. | ||
39.811 | 1750. | ||
40.989 | 2000. | ||
41.862 | 2250. | ||
42.522 | 2500. | ||
43.028 | 2750. | ||
43.427 | 3000. |
Constant pressure heat capacity of gas
Cp,gas (cal/mol*K) | Temperature (K) | Reference | Comment |
---|---|---|---|
14.82 | 272.20 | Kistiakowsky G.B., 1940 | GT |
15.75 | 300.76 | ||
16.81 | 333.25 | ||
17.96 | 370.42 |

Phase change data

Data compiled as indicated in comments:
BS - Robert L. Brown and Stephen E. Stein
TRC - Thermodynamics Research Center, NIST Boulder Laboratories, Chris Muzny director
AC - William E. Acree, Jr., James S. Chickos
DH - Eugene S. Domalski and Elizabeth D. Hearing
Quantity | Value | Units | Method | Reference | Comment |
---|---|---|---|---|---|
Tboil | 248.2 | K | N/A | Weast and Grasselli, 1989 | BS |
Tboil | 248.3 | K | N/A | Majer and Svoboda, 1985 | |
Tboil | 248.25 | K | N/A | Grosse, 1937 | Uncertainty assigned by TRC = 1. K; TRC |
Tboil | 249.2 | K | N/A | Maass and Boomer, 1922 | Uncertainty assigned by TRC = 0.4 K; TRC |
Tboil | 249.5 | K | N/A | Thiele and Schulte, 1920 | Uncertainty assigned by TRC = 0.6 K; TRC |
Quantity | Value | Units | Method | Reference | Comment |
Tfus | 135.2 | K | N/A | Maass and Boomer, 1922 | Uncertainty assigned by TRC = 2. K; TRC |
Quantity | Value | Units | Method | Reference | Comment |
Ttriple | 131.64 | K | N/A | Wilhoit, Chao, et al., 1985 | Uncertainty assigned by TRC = 0.05 K; TRC |
Ttriple | 131.66 | K | N/A | Kennedy, Sagenkahn, et al., 1941, 2 | Uncertainty assigned by TRC = 0.06 K; TRC |
Quantity | Value | Units | Method | Reference | Comment |
Tc | 401. ± 2. | K | AVG | N/A | Average of 12 values; Individual data points |
Quantity | Value | Units | Method | Reference | Comment |
Pc | 53. ± 3. | atm | AVG | N/A | Average of 8 values; Individual data points |
Quantity | Value | Units | Method | Reference | Comment |
Vc | 0.164 | l/mol | N/A | Zawisza and Glowka, 1970 | Uncertainty assigned by TRC = 0.003 l/mol; TRC |
Quantity | Value | Units | Method | Reference | Comment |
ρc | 5.351 | mol/l | N/A | Edwards and Maass, 1935 | Uncertainty assigned by TRC = 0.43 mol/l; TRC |
ρc | 4.895 | mol/l | N/A | Tapp, Steacie, et al., 1933 | Uncertainty assigned by TRC = 0.65 mol/l; TRC |
ρc | 5.891 | mol/l | N/A | Cardoso and Coppola, 1923 | Uncertainty assigned by TRC = 0.07 mol/l; extraplation of rectilinear diameter, from obs L and G densities, to Tc = 126.9 deg C, from previous literature; TRC |
Quantity | Value | Units | Method | Reference | Comment |
ΔvapH° | 4.61 | kcal/mol | N/A | Majer and Svoboda, 1985 | |
ΔvapH° | 4.42 | kcal/mol | N/A | Ambrose, Ellender, et al., 1976 | Based on data from 171. to 248. K.; AC |
Enthalpy of vaporization
ΔvapH (kcal/mol) | Temperature (K) | Method | Reference | Comment |
---|---|---|---|---|
5.1410 | 248.34 | N/A | Kennedy, Sagenkahn, et al., 1941 | P = 101.325 kPa; DH |
5.141 | 248.3 | N/A | Majer and Svoboda, 1985 | |
5.40 | 250. | A | Stephenson and Malanowski, 1987 | Based on data from 183. to 265. K.; AC |
5.45 | 234. | A | Stephenson and Malanowski, 1987 | Based on data from 180. to 249. K.; AC |
5.07 | 308. | A | Stephenson and Malanowski, 1987 | Based on data from 293. to 360. K.; AC |
5.04 | 364. | A | Stephenson and Malanowski, 1987 | Based on data from 349. to 400. K.; AC |
5.31 | 256. | A | Stephenson and Malanowski, 1987 | Based on data from 241. to 303. K.; AC |
5.11 | 248. | N/A | Ambrose, Ellender, et al., 1976 | Based on data from 171. to 248. K.; AC |
5.43 | 233. | N/A | Kennedy, Sagenkahn, et al., 1941 | Based on data from 195. to 248. K.; AC |
5.14 ± 0.02 | 248. | C | Kennedy, Sagenkahn, et al., 1941 | AC |
Entropy of vaporization
ΔvapS (cal/mol*K) | Temperature (K) | Reference | Comment |
---|---|---|---|
20.70 | 248.34 | Kennedy, Sagenkahn, et al., 1941 | P; DH |
Antoine Equation Parameters
log10(P) = A − (B / (T + C))
P = vapor pressure (atm)
T = temperature (K)
View plot Requires a JavaScript / HTML 5 canvas capable browser.
Temperature (K) | A | B | C | Reference | Comment |
---|---|---|---|---|---|
194.93 to 248.24 | 4.10904 | 894.669 | -30.604 | Kennedy, Sagenkahn, et al., 1941 | Coefficents calculated by NIST from author's data. |
Enthalpy of fusion
ΔfusH (kcal/mol) | Temperature (K) | Reference | Comment |
---|---|---|---|
1.1798 | 131.66 | Kennedy, Sagenkahn, et al., 1941 | DH |
1.18 | 131.7 | Domalski and Hearing, 1996 | AC |
Entropy of fusion
ΔfusS (cal/mol*K) | Temperature (K) | Reference | Comment |
---|---|---|---|
8.960 | 131.66 | Kennedy, Sagenkahn, et al., 1941 | DH |

References

Kennedy, Sagenkahn, et al., 1941
Kennedy, R.M.; Sagenkahn, M.; Aston, J.G.,
The heat capacity and entropy, heats of fusion and vaporization, and the vapor pressure of dimethyl ether. The density of gaseous dimethyl ether,
J. Am. Chem. Soc., 1941, 63, 2267-2272. [all data]
Rodgers and Armentrout, 2000
Rodgers, M.T.; Armentrout, P.B.,
Noncovalent Metal-Ligand Bond Energies as Studied by Threshold Collision-Induced Dissociation,
Mass Spectrom. Rev., 2000, 19, 4, 215, https://doi.org/10.1002/1098-2787(200007)19:4<215::AID-MAS2>3.0.CO;2-X
. [all data]
Woodin and Beauchamp, 1978
Woodin, R.L.; Beauchamp, J.L.,
Bonding of Li+ to Lewis Bases in the Gas Phase. Reversals in Methyl Substituent Effects for Different Reference Acids,
J. Am. Chem. Soc., 1978, 100, 2, 501, https://doi.org/10.1021/ja00470a024
. [all data]
Dzidic and Kebarle, 1970
Dzidic, I.; Kebarle, P.,
Hydration of the Alkali Ions in the Gas Phase. Enthalpies and Entropies of Reactions M+(H2O)n-1 + H2O = M+(H2O)n,
J. Phys. Chem., 1970, 74, 7, 1466, https://doi.org/10.1021/j100702a013
. [all data]
Staley and Beauchamp, 1975
Staley, R.H.; Beauchamp, J.L.,
Intrinsic Acid - Base Properties of Molecules. Binding Energies of Li+ to pi - and n - Donor Bases,
J. Am. Chem. Soc., 1975, 97, 20, 5920, https://doi.org/10.1021/ja00853a050
. [all data]
More, Gledening, et al., 1996
More, M.B.; Gledening, E.D.; Ray, D.; Feller, D.; Armentrout, P.B.,
Cation-Ether Complexes in the Gas Phase: Bond Dissociation Energies and Equilibrium Structures of Li+[O(CH3)2]x, x=1-4,
J. Phys. Chem., 1996, 100, 5, 1605, https://doi.org/10.1021/jp9523175
. [all data]
Larson and McMahon, 1982
Larson, J.W.; McMahon, T.B.,
Formation, Thermochemistry, and Relative Stabilities of Proton - Bound dimers of Oxygen n - Donor Bases from Ion Cyclotron Resonance Solvent - Exchange Equilibria Measurements,
J. Am. Chem. Soc., 1982, 104, 23, 6255, https://doi.org/10.1021/ja00387a016
. [all data]
Grimsrud and Kebarle, 1973
Grimsrud, E.P.; Kebarle, P.,
Gas Phase Ion Equilibria Studies of the Solvation of the Hydrogen Ion by Methanol, Dimethyl Ether and Water. Effect of Hydrogen Bonding,
J. Am. Chem. Soc., 1973, 95, 24, 7939, https://doi.org/10.1021/ja00805a002
. [all data]
Lias, Liebman, et al., 1984
Lias, S.G.; Liebman, J.F.; Levin, R.D.,
Evaluated gas phase basicities and proton affinities of molecules heats of formation of protonated molecules,
J. Phys. Chem. Ref. Data, 1984, 13, 695. [all data]
Keesee and Castleman, 1986
Keesee, R.G.; Castleman, A.W., Jr.,
Thermochemical data on Ggs-phase ion-molecule association and clustering reactions,
J. Phys. Chem. Ref. Data, 1986, 15, 1011. [all data]
Amicangelo and Armentrout, 2001
Amicangelo, J.C.; Armentrout, P.B.,
Relative and Absolute Bond Dissociation Energies of Sodium Cation Complexes Determined Using Competitive Collision-Induced Dissociation Experiments,
Int. J. Mass Spectrom., 2001, 212, 1-3, 301, https://doi.org/10.1016/S1387-3806(01)00494-8
. [all data]
Armentrout and Rodgers, 2000
Armentrout, P.B.; Rodgers, M.T.,
An Absolute Sodium Cation Affinity Scale: Threshold Collision-Induced Dissociation Experiments and ab Initio Theory,
J. Phys. Chem A, 2000, 104, 11, 2238, https://doi.org/10.1021/jp991716n
. [all data]
More, Ray, et al., 1997
More, M.B.; Ray, D.; Armentrout, P.B.,
Cation-ether complexes in the gas phase: Bond dissociation energies of Na+(dimethyl ether)(x), x=1-4; Na+(1,2-dimethoxyethane)(x), x=1 and 2; and Na+(12-crown-4),
J. Phys. Chem. AJOURNAL OF PHYSICAL CHEMISTRY A 101 (5): 831-839 JAN 30 1997, 1997, 101, 831. [all data]
McMahon and Ohanessian, 2000
McMahon, T.B.; Ohanessian, G.,
An Experimental and Ab Initio Study of the Nature of the Binding in Gas-Phase Complexes of Sodium Ions,
Chem. Eur. J., 2000, 6, 16, 2931, https://doi.org/10.1002/1521-3765(20000818)6:16<2931::AID-CHEM2931>3.0.CO;2-7
. [all data]
Meot-Ner (Mautner), 1989
Meot-Ner (Mautner), M.,
Ion DChemistry of Ferrocene. Thermochemistry of Ionization and Protonation and Solvent Clustering. Slow and Entropy - Driven Proton - Transfer Kinetics,
J. Am. Chem. Soc., 1989, 111, 8, 2830, https://doi.org/10.1021/ja00190a014
. [all data]
Hiraoka, Grimsrud, et al., 1974
Hiraoka, K.; Grimsrud, E.P.; Kebarle, P.,
Gas Phase Ion Equilibria Studies of the Hydrogen Ion in Water - Dimethyl Ether and Methanol - Dimethyl Ether Mixtures,
J. Am. Chem. Soc., 1974, 96, 11, 3359, https://doi.org/10.1021/ja00818a004
. [all data]
Meot-Ner (Mautner) and Sieck, 1991
Meot-Ner (Mautner), M.; Sieck, L.W.,
Proton affinity ladders from variable-temperature equilibrium measurements. 1. A reevaluation of the upper proton affinity range,
J. Am. Chem. Soc., 1991, 113, 12, 4448, https://doi.org/10.1021/ja00012a012
. [all data]
Davidson and Kebarle, 1976
Davidson, W.R.; Kebarle, P.,
Binding Energies and Stabilities of Potassium Ion Complexes with Ethylene Diamine and Dimethoxyethane (Glyme) from Measurements of the Complexing Equilibria in the Gas Phase,
Can. J. Chem., 1976, 54, 16, 2594, https://doi.org/10.1139/v76-368
. [all data]
Davidson and Kebarle, 1976, 2
Davidson, W.R.; Kebarle, P.,
Binding Energies and Stabilities of Potassium Ion Complexes from Studies of Gas Phase Ion Equilibria K+ + M = K+.M,
J. Am. Chem. Soc., 1976, 98, 20, 6133, https://doi.org/10.1021/ja00436a011
. [all data]
Tholman, Tonner, et al., 1994
Tholman, D.; Tonner, D.S.; McMahon, T.B.,
Spontaneous Unimolecular Dissociation of Small Cluster Ions, (H3O)+(L)n and Cl-(H2O)n (n = 2-4), under Fourier Transform Ion Cyclotron Resonance Conditions,
J. Phys. Chem., 1994, 98, 8, 2002, https://doi.org/10.1021/j100059a002
. [all data]
Meot-Ner, 1984
Meot-Ner, (Mautner)M.,
The Ionic Hydrogen Bond and Ion Solvation. 1. -NH+ O-, -NH+ N- and -OH+ O- Bonds. Correlations with Proton Affinity. Deviations Due to Structural Effects,
J. Am. Chem. Soc., 1984, 106, 5, 1257, https://doi.org/10.1021/ja00317a015
. [all data]
Bogdanov, Lee, et al., 2001
Bogdanov, B.; Lee, H.J.S.; McMahon, T.B.,
Influence of fluorine substitution on the structures and thermochemistry of chloride ion-ether complexes in the gas phase,
Int. J. Mass Spectrom., 2001, 210, 387-402, https://doi.org/10.1016/S1387-3806(01)00404-3
. [all data]
DePuy, Bierbaum, et al., 1984
DePuy, C.H.; Bierbaum, V.M.; Damrauer, R.,
Relative Gas-Phase Acidities of the Alkanes,
J. Am. Chem. Soc., 1984, 106, 4051. [all data]
Koizumi, 2001
Koizumi, H.,
Collision-Induced Dissociation and Theoretical Studies of Cu+-Dimethyl Ether Complexes,
J.Phys. Chem. A, 2001, 105, 11, 2444, https://doi.org/10.1021/jp003509p
. [all data]