Ethane, 1-chloro-2-[(2-ethoxyethyl)thio]-
- Formula: C6H13ClOS
- Molecular weight: 168.685
- IUPAC Standard InChIKey: UXYAOPOYEMOOHI-UHFFFAOYSA-N
- CAS Registry Number: 114811-33-5
- Chemical structure:
View 3d structure (requires JavaScript / HTML 5) - Other names: (2-Chloroethylthio)ethyl ethyl ether

Van Den Dool and Kratz RI, non-polar column, temperature ramp

Column type | Active phase | I | Reference | Comment |
---|---|---|---|---|
Capillary | OV-1 | 1169. | Kostiainen, 2000 | 15. m/0.32 mm/0.25 μm, He, 50. C @ 2. min, 10. K/min, 280. C @ 10. min |
Capillary | DB-1 | 1169. | D'agostino and Provost, 1988 | 15. m/0.32 mm/0.25 μm, He, 50. C @ 2. min, 10. K/min, 300. C @ 5. min |
Capillary | DB-5 | 1200. | D'agostino and Provost, 1988 | 15. m/0.32 mm/0.25 μm, 50. C @ 2. min, 10. K/min, 300. C @ 5. min |

References

Kostiainen, 2000
Kostiainen, O.,
Gas Chromatography in Screening of Chemicals Related to the Chemical Weapons Convention
in Encyclopedia of Analytical Chemistry, Meyers, R.A., ed(s)., John Wiley Sons Ltd, Chichester, 2000, 963-979. [all data]
D'agostino and Provost, 1988
D'agostino, P.A.; Provost, L.R.,
Gas chromatographic retention indices of sulphur vesicants and related compounds,
J. Chromatogr., 1988, 436, 399-411, https://doi.org/10.1016/S0021-9673(00)94599-0
. [all data]