Bicyclo[2.2.2]oct-5-ene-2-carbonitrile, 3-methyl-, (1α,2β,3α,4α)- (exo,endo)

Gas phase thermochemistry data

Data compiled by: Hussein Y. Afeefy, Joel F. Liebman, and Stephen E. Stein

Quantity Value Units Method Reference Comment
Δfgas136.kJ/molKinVan Mele and Huybrechts, 1988

References

Van Mele and Huybrechts, 1988
Van Mele, B.; Huybrechts, G., Kinetics and mechanism of the thermal reactions of endo- and exo-5-cyanobicyclo[2.2.2]oct-2-ene and methyl-substituted derivatives in the gas phase, Int. J. Chem. Kinet., 1988, 19, 885-894. [all data]