Benzoylglycylglycine
- Formula: C11H12N2O4
- Molecular weight: 236.2240
- IUPAC Standard InChIKey: FWYPSSZPXQVFRB-UHFFFAOYSA-N
- CAS Registry Number: 1145-32-0
- Chemical structure:
View 3d structure (requires JavaScript / HTML 5) - Other names: Glycine, N-(N-benzoylglycyl)-; Glycine, N-hippuroyl-; Hippurylglycine

Condensed phase thermochemistry data

Data compiled as indicated in comments:
ALS - Hussein Y. Afeefy, Joel F. Liebman, and Stephen E. Stein
DH - Eugene S. Domalski and Elizabeth D. Hearing
Quantity | Value | Units | Method | Reference | Comment |
---|---|---|---|---|---|
ΔfH°solid | -833.0 ± 1.5 | kJ/mol | Ccb | Huffman, 1942 | Heat of combustion corrected for pressure; ALS |
Quantity | Value | Units | Method | Reference | Comment |
ΔcH°solid | -5210.7 ± 1.4 | kJ/mol | Ccb | Huffman, 1942 | Heat of combustion corrected for pressure; ALS |
Quantity | Value | Units | Method | Reference | Comment |
S°solid,1 bar | 314.6 | J/mol*K | N/A | Huffman, 1941 | Extrapolation below 90 K, 101.01 J/mol*K.; DH |
Constant pressure heat capacity of solid
Cp,solid (J/mol*K) | Temperature (K) | Reference | Comment |
---|---|---|---|
277.52 | 296.7 | Huffman, 1941 | T = 85 to 297 K.; DH |

References

Huffman, 1942
Huffman, H.M.,
Thermal data. XV. The heats of combustion and free energies of some compounds containing the peptide bond,
J. Phys. Chem., 1942, 46, 885-891. [all data]
Huffman, 1941
Huffman, H.M.,
Thermal data. XIV. The heat capacities and entropies of some compounds having the peptide bond,
J. Am. Chem. Soc., 1941, 63, 688-689. [all data]