Anthralin
- Formula: C14H10O3
- Molecular weight: 226.2274
- IUPAC Standard InChIKey: NUZWLKWWNNJHPT-UHFFFAOYSA-N
- CAS Registry Number: 1143-38-0
- Chemical structure:
View 3d structure (requires JavaScript / HTML 5) - Other names: 9(10H)-Anthracenone, 1,8-dihydroxy-; Anthrone, 1,8-dihydroxy-; 1,8-Dihydroxy-9-anthrone; 1,8-Dihydroxyanthrone; Anthra-derm; Batridol; Chrysodermol; Cignolin; Cigthranol; Dithranol; Psoriacid-Stift; Batidrol; DrithoCreme; Drithoscalp; Lasan; Psodadrate; Psoriacide; NSC 43970; NSC 629313; 1,8-dihydroxyanthracen-9(10H)-one

Van Den Dool and Kratz RI, non-polar column, temperature ramp

Column type | Active phase | I | Reference | Comment |
---|---|---|---|---|
Capillary | VF-5MS | 2220. | Todua, 2011 | 30. m/0.25 mm/0.25 μm, He; Tstart: 60. C; Tend: 270. C |

References

Todua, 2011
Todua, N.G.,
Retention Data. NIST Mass Spectrometry Data Center., NIST Mass Spectrometry Data Center, 2011. [all data]