CAS Reg. No. 1140500-24-8
- CAS Registry Number: 1140500-24-8

Reaction thermochemistry data

Data compiled by: John E. Bartmess
Individual Reactions
(CAS Reg. No. 1140500-24-8 • 4294967295) +
= CAS Reg. No. 1140500-24-8
By formula: (CAS Reg. No. 1140500-24-8 • 4294967295CHNO) + CHNO = CAS Reg. No. 1140500-24-8
Quantity | Value | Units | Method | Reference | Comment |
---|---|---|---|---|---|
ΔrH° | 43.1 ± 3.0 | kcal/mol | N/A | Taft, 1987 | gas phase; value altered from reference due to change in acidity scale |

References

Taft, 1987
Taft, R.W.,
The Nature and Analysis of Substitutent Electronic Effects,
Personal communication. See also Prog. Phys. Org. Chem., 1987, 16, 1. [all data]