Dothiepin
- Formula: C19H21NS
- Molecular weight: 295.442
- IUPAC Standard InChIKey: PHTUQLWOUWZIMZ-GZTJUZNOSA-N
- CAS Registry Number: 113-53-1
- Chemical structure:
View 3d structure (requires JavaScript / HTML 5) - Other names: 1-Propanamine, 3-dibenzo[b,e]thiepin-11(6H)-ylidene-N,N-dimethyl-; Dosulepin; Dibenzo[b,e]thiepin, 1-propanamine deriv.; Dibenzo[b,e]thiepin-Δ11(6H),γ-propylamine, N,N-dimethyl-; Dosulepine; IZ 914; Prothiaden; Prothiadene; Propylamine, N,N-dimethyl-3-(dibenzo(b,e)thiepin-Δ(11(6H),γ)-; 3-Dibenzo(b,e)thiepin-11(6H)-ylidene-N,N-dimethyl-1-propamine; 11-(3-Dimethylaminopropylidene)-6,11-dihydrodibenzo(b,e)thiepin; N,N-Dimethyldibenzo(b,e)thiepin-Δ11(6H,γ-propylamine; Prothiaden spofa; 3-Dibenzo[b,e]thiepin-11(6H)-ylidine-N,N-dimethyl-propanamine; Dothep

Kovats' RI, non-polar column, temperature ramp

Column type | Active phase | I | Reference | Comment |
---|---|---|---|---|
Capillary | HP-1 | 2385. | Bickeboeller-Friedrich and Maurer, 2001 | 12. m/0.2 mm/0.33 μm, He, 100. C @ 3. min, 30. K/min, 310. C @ 8. min |

Van Den Dool and Kratz RI, non-polar column, temperature ramp

Column type | Active phase | I | Reference | Comment |
---|---|---|---|---|
Capillary | VF-5MS | 2460.5 | Tretyakov, 2014 | 30. m/0.25 mm/0.25 μm, He; Tstart: 60. C; Tend: 270. C |

Van Den Dool and Kratz RI, non-polar column, custom temperature program

Column type | Active phase | I | Reference | Comment |
---|---|---|---|---|
Capillary | BP-1 | 2364. | Stowell and Wilson, 1987 | 12. m/0.22 mm/0.25 μm, He; Program: 120C => 8C/min => 270C => 25C/min => 300C |

Normal alkane RI, non-polar column, custom temperature program

Column type | Active phase | I | Reference | Comment |
---|---|---|---|---|
Capillary | Polydimethyl siloxanes | 2380. | Schutz and Wollrab A., 1988 | Program: not specified |
Other | Methyl Silicone | 2380. | Ardrey and Moffat, 1981 | Program: not specified |

References

Bickeboeller-Friedrich and Maurer, 2001
Bickeboeller-Friedrich, J.; Maurer, H.H.,
Screening for detection of new antidepressants, neuroleptics, hypnotics, and their metabolites in urine by GC-MS developed using rat liver microsomes,
Ther. Drug Monit., 2001, 23, 1, 61-70, https://doi.org/10.1097/00007691-200102000-00012
. [all data]
Tretyakov, 2014
Tretyakov, K.V.,
Retention Data. NIST Mass Spectrometry Data Center., NIST Mass Spectrometry Data Center, 2014. [all data]
Stowell and Wilson, 1987
Stowell, A.; Wilson, L.W.,
A simple approach to the interlaboratory transfer of drug retention indices determined by temperature programmed capillary gas chromatography,
J. Forensic Sci., 1987, 32, 5, 1214-1220. [all data]
Schutz and Wollrab A., 1988
Schutz, H.; Wollrab A.,
The significance of the retention index in toxicologic analysis II,
Pharmazie in unzerer Zeit, 1988, 17, 4, 97-101. [all data]
Ardrey and Moffat, 1981
Ardrey, R.E.; Moffat, A.C.,
Gas-liquid chromatographic retention indices of 1318 substances of toxicological interest on SE-30 or OV-1 stationary phase,
J. Chromatogr., 1981, 220, 3, 195-252, https://doi.org/10.1016/S0021-9673(00)81925-1
. [all data]