Arachidonic acid, TMS derivative
- Formula: C23H40O2Si
- Molecular weight: 376.6480
- IUPAC Standard InChIKey: WKCGHSAPDCPZBQ-SNPVRQPZSA-N
- CAS Registry Number: 113516-18-0
- Chemical structure:
View 3d structure (requires JavaScript / HTML 5) - Other names: Arachidonic acid, trimethylsilyl ester; Arachidonic acid, TMS; cis-5,8,11,14-Eicosatetraenoic acid, trimethylsilyl ester

Van Den Dool and Kratz RI, non-polar column, custom temperature program

Column type | Active phase | I | Reference | Comment |
---|---|---|---|---|
Capillary | VF-5MS | 2372.7 | Tret'yakov, 2007 | 30. m/0.25 mm/0.25 μm, He; Program: Multi-step temperature program; T(initial)=60C; T(final)=270C |
Capillary | DB-1 | 2359. | Tsai, Oliphant, et al., 1985 | He; Program: not specified |

Normal alkane RI, non-polar column, temperature ramp

Column type | Active phase | I | Reference | Comment |
---|---|---|---|---|
Capillary | HP-5 | 2393. | Isidorov, Lech, et al., 2008 | 30. m/0.25 mm/0.25 μm, Helium, 3. K/min, 300. C @ 30. min; Tstart: 50. C |

References

Tret'yakov, 2007
Tret'yakov, K.V.,
Retention Data. NIST Mass Spectrometry Data Center., NIST Mass Spectrometry Data Center, 2007. [all data]
Tsai, Oliphant, et al., 1985
Tsai, M.Y.; Oliphant, C.; Josephson, M.W.,
Identification of Metabolites Diagnostic for Organic Acidurias by Simultaneous Dual-Column Capillary Gas Chromatography,
J. Chromatogr., 1985, 341, 1-10, https://doi.org/10.1016/S0378-4347(00)84004-9
. [all data]
Isidorov, Lech, et al., 2008
Isidorov, V.A.; Lech, P.; Zolciak, A.; Rusak, N.; Szczepaniak, L.,
Gas Chromatographic - nass spectrometric investigation of metabolites from the needles and roots of pine seedlings at early stages of pathogenic fungi Armillaria ostoyae attack,
Trees, 2008, 22, 4, 531-542, https://doi.org/10.1007/s00468-008-0213-z
. [all data]