Benzenamine, 4-(phenylthio)-
- Formula: C12H11NS
- Molecular weight: 201.287
- IUPAC Standard InChIKey: TZQVSGOOKNNDFU-UHFFFAOYSA-N
- CAS Registry Number: 1135-14-4
- Chemical structure:
View 3d structure (requires JavaScript / HTML 5) - Other names: 4-Aminodiphenylsulfide

Phase change data

Data compiled by: Robert L. Brown and Stephen E. Stein
Quantity | Value | Units | Method | Reference | Comment |
---|---|---|---|---|---|
Tfus | 369. | K | N/A | Buckingham and Donaghy, 1982 |
Reduced pressure boiling point
Tboil (K) | Pressure (bar) | Reference |
---|---|---|
555.2 | 0.133 | Weast and Grasselli, 1989 |
555. | 0.133 | Buckingham and Donaghy, 1982 |
516. | 0.039 | Buckingham and Donaghy, 1982 |

References

Buckingham and Donaghy, 1982
Buckingham, J.; Donaghy, S.M.,
Dictionary of Organic Compounds: Fifth Edition, Chapman and Hall, New York, 1982, 1. [all data]
Weast and Grasselli, 1989
CRC Handbook of Data on Organic Compounds, 2nd Editon, Weast,R.C and Grasselli, J.G., ed(s)., CRC Press, Inc., Boca Raton, FL, 1989, 1. [all data]