Naphthalene, 2-butyl-
- Formula: C14H16
- Molecular weight: 184.2768
- IUPAC Standard InChIKey: UKAMWVYNAVUZEA-UHFFFAOYSA-N
- CAS Registry Number: 1134-62-9
- Chemical structure:
View 3d structure (requires JavaScript / HTML 5) - Other names: β-Butylnaphthalene; 2-Butylnaphthalene

Phase change data

Data compiled by: Thermodynamics Research Center, NIST Boulder Laboratories, Chris Muzny director
Quantity | Value | Units | Method | Reference | Comment |
---|---|---|---|---|---|
Tboil | 560. ± 9. | K | AVG | N/A | Average of 7 values; Individual data points |
Quantity | Value | Units | Method | Reference | Comment |
Tfus | 268. | K | N/A | Bailey, Pickering, et al., 1949 | Uncertainty assigned by TRC = 3. K |
Tfus | 265.1 | K | N/A | Koelbel, 1949 | Uncertainty assigned by TRC = 1.5 K |
Tfus | 220. | K | N/A | Petrov and Andreev, 1942 | Uncertainty assigned by TRC = 4. K |

Kovats' RI, non-polar column, isothermal

Column type | Active phase | Temperature (C) | I | Reference | Comment |
---|---|---|---|---|---|
Packed | OV-1 | 150. | 1570. | Antal, 1984 | Chromosorb W HP; Column length: 2.5 m |
Packed | OV-3 | 150. | 1611. | Antal, 1984 | Chromosorb W HP; Column length: 2.5 m |
Capillary | OV-1 | 130. | 1564. | Engewald, Wennrich, et al., 1979 | Column length: 50. m; Column diameter: 0.23 mm |

References

Bailey, Pickering, et al., 1949
Bailey, A.S.; Pickering, G.B.; Smith, J.C.,
Alkylnaphthalenes: III the n-butyl, amyl, and hexylnaphthalenes,
J. Inst. Pet., 1949, 35, 103-17. [all data]
Koelbel, 1949
Koelbel, H.,
Alkylnaphthalenes as Lubricating-oil Models,
Brennst.-Chem., 1949, 30, 73-80. [all data]
Petrov and Andreev, 1942
Petrov, A.D.; Andreev, D.N.,
Synthesis of Monoalkylnaphthalenes and Their Hydro Derivatives,
Zh. Obshch. Khim., 1942, 12, 95. [all data]