9H-Fluorene, 2-bromo-
- Formula: C13H9Br
- Molecular weight: 245.115
- IUPAC Standard InChIKey: FXSCJZNMWILAJO-UHFFFAOYSA-N
- CAS Registry Number: 1133-80-8
- Chemical structure:
View 3d structure (requires JavaScript / HTML 5) - Other names: 2-Bromofluorene; 2-bromo-9H-fluorene

Phase change data

Data compiled by: Robert L. Brown and Stephen E. Stein
Reduced pressure boiling point
Tboil (K) | Pressure (bar) | Reference |
---|---|---|
458.2 | 0.180 | Weast and Grasselli, 1989 |
430. to 433. | 0.001 | Frinton Laboratories Inc., 1986 |

References

Weast and Grasselli, 1989
CRC Handbook of Data on Organic Compounds, 2nd Editon, Weast,R.C and Grasselli, J.G., ed(s)., CRC Press, Inc., Boca Raton, FL, 1989, 1. [all data]
Frinton Laboratories Inc., 1986
Frinton Laboratories Inc.,
Catalog Number 11, Frinton Laboratories Inc., Vineland, NJ, 1986, 99. [all data]
Bergmann, et al., 1952
Bergmann, E.D., et al.,
Bull. soc. chim France, 1952, [5] 19, 703. [all data]