Ethchlorvynol
- Formula: C7H9ClO
- Molecular weight: 144.599
- IUPAC Standard InChIKey: ZEHYJZXQEQOSON-AATRIKPKSA-N
- CAS Registry Number: 113-18-8
- Chemical structure:
View 3d structure (requires JavaScript / HTML 5) - Other names: 1-Penten-4-yn-3-ol, 1-chloro-3-ethyl-; Alvinol; Ethchlorovynol; Ethchlorvinol; Ethochlorvynol; Ethyl β-chlorovinyl ethynyl carbinol; Normosan; Normoson; Nostel; Placidyl; Serensil; β-Chlorovinyl ethyl ethynyl carbinol; A 71; Aethyl-chlorvynol; Arvynol; Etchlorvinolo; Ethchlorvinyl; Ethychlorvynol; Normonson; Placidil; Roeridorm; Serenil; 1-Chloro-3-ethyl-1-penten-4-yn-3-ol; 3-(β-chlorovinyl)-1-pentyn-3-ol; Ethclorvynol; Serensiloline; Nromoson; Serenesil; NSC 30372; (1E)-1-Chloro-3-ethyl-1-penten-4-yn-3-ol

Van Den Dool and Kratz RI, non-polar column, temperature ramp

Column type | Active phase | I | Reference | Comment |
---|---|---|---|---|
Capillary | Methyl Silicone | 1001.0 | Newton and Foery, 1984 | 12. m/0.2 mm/0.33 μm, He, 50. C @ 1. min, 20. K/min, 300. C @ 3. min |
Capillary | 5 % Phenyl methyl siloxane | 1020.0 | Newton and Foery, 1984 | 12. m/0.2 mm/0.33 μm, He, 50. C @ 1. min, 20. K/min, 300. C @ 3. min |
Packed | SE-30 | 1030. | Perrigo and Peel, 1981 | N2, Chromosorb W, 130. C @ 2. min, 8. K/min, 290. C @ 8. min; Column length: 1.8 m |

Van Den Dool and Kratz RI, non-polar column, custom temperature program

Column type | Active phase | I | Reference | Comment |
---|---|---|---|---|
Capillary | VF-5MS | 1005.6 | Tret'yakov, 2008 | 30. m/0.25 mm/0.25 μm, He; Program: Multi-step temperature program; T(initial)=60C; T(final)=270C |

Normal alkane RI, non-polar column, custom temperature program

Column type | Active phase | I | Reference | Comment |
---|---|---|---|---|
Capillary | OV-1 | 1030. | Ramsey and Flanagan, 1982 | Program: not specified |
Other | Methyl Silicone | 1023. | Ardrey and Moffat, 1981 | Program: not specified |

Normal alkane RI, polar column, custom temperature program

Column type | Active phase | I | Reference | Comment |
---|---|---|---|---|
Capillary | Carbowax 20M | 1445. | Ramsey and Flanagan, 1982 | Program: not specified |

References

Newton and Foery, 1984
Newton, B.; Foery, R.F.,
Retention indices and dual capillary gas chromatography for rapid identification of sedative hypnotic drugs in emergency toxicology,
J. Anal. Toxicol., 1984, 8, 3, 129-134, https://doi.org/10.1093/jat/8.3.129
. [all data]
Perrigo and Peel, 1981
Perrigo, B.J.; Peel, H.W.,
The use of retention indices and temperature-programmed gas chromatography in analytical toxicology,
J. Chromatogr. Sci., 1981, 19, 5, 219-226, https://doi.org/10.1093/chromsci/19.5.219
. [all data]
Tret'yakov, 2008
Tret'yakov, K.V.,
Retention Data. NIST Mass Spectrometry Data Center., NIST Mass Spectrometry Data Center, 2008. [all data]
Ramsey and Flanagan, 1982
Ramsey, J.D.; Flanagan, R.J.,
Detection and Identification of Volatile Organic Compounds in Blood by Headspace Gas Chromatography as an Aid to the Diagnosis of Solvent Abuse,
J. Chromatogr., 1982, 240, 2, 423-444, https://doi.org/10.1016/S0021-9673(00)99622-5
. [all data]
Ardrey and Moffat, 1981
Ardrey, R.E.; Moffat, A.C.,
Gas-liquid chromatographic retention indices of 1318 substances of toxicological interest on SE-30 or OV-1 stationary phase,
J. Chromatogr., 1981, 220, 3, 195-252, https://doi.org/10.1016/S0021-9673(00)81925-1
. [all data]