1H-Pyrazol-5-amine, 3-methyl-1-phenyl-
- Formula: C10H11N3
- Molecular weight: 173.2144
- IUPAC Standard InChIKey: FMKMKBLHMONXJM-UHFFFAOYSA-N
- CAS Registry Number: 1131-18-6
- Chemical structure:
View 3d structure (requires JavaScript / HTML 5) - Other names: 1-Phenyl-3-methyl-5-aminopyrazole; 1H-Pyrazole-5-amine, 3-methyl-1-phenyl-; 5-Amino-3-methyl-1-phenylpyrazole; Pyrazole, 5-amino-3-methyl-1-phenyl-; 3-Methyl-1-phenyl-1H-pyrazol-5-amine; 3-methyl-1-phenylpyrazol-5-ylamine

Phase change data

Data compiled by: Robert L. Brown and Stephen E. Stein
Quantity | Value | Units | Method | Reference | Comment |
---|---|---|---|---|---|
Tboil | 606.2 | K | N/A | Weast and Grasselli, 1989 | |
Quantity | Value | Units | Method | Reference | Comment |
Tfus | 389. | K | N/A | Buckingham and Donaghy, 1982 |
Reduced pressure boiling point
Tboil (K) | Pressure (bar) | Reference |
---|---|---|
470.2 | 0.021 | Weast and Grasselli, 1989 |
606. | 1.01 | Buckingham and Donaghy, 1982 |
470. | 0.021 | Buckingham and Donaghy, 1982 |

References

Weast and Grasselli, 1989
CRC Handbook of Data on Organic Compounds, 2nd Editon, Weast,R.C and Grasselli, J.G., ed(s)., CRC Press, Inc., Boca Raton, FL, 1989, 1. [all data]
Buckingham and Donaghy, 1982
Buckingham, J.; Donaghy, S.M.,
Dictionary of Organic Compounds: Fifth Edition, Chapman and Hall, New York, 1982, 1. [all data]