Cyclododecyne
- Formula: C12H20
- Molecular weight: 164.2872
- IUPAC Standard InChIKey: BYDOJAHKOHCERE-UHFFFAOYSA-N
- CAS Registry Number: 1129-90-4
- Chemical structure:
View 3d structure (requires JavaScript / HTML 5) - Permanent link for this species. Use this link for bookmarking this species for future reference.

Reaction thermochemistry data

Data compiled by: Hussein Y. Afeefy, Joel F. Liebman, and Stephen E. Stein
Individual Reactions
By formula: C12H20 + 2H2 = C12H24
Quantity | Value | Units | Method | Reference | Comment |
---|---|---|---|---|---|
ΔrH° | -258.4 ± 1.7 | kJ/mol | Chyd | Turner, Jarrett, et al., 1973 | liquid phase; solvent: Acetic acid |
ΔrH° | -258. | kJ/mol | Chyd | Sicher, Svoboda, et al., 1968 | liquid phase; solvent: Acetic acid |

References

Turner, Jarrett, et al., 1973
Turner, R.B.; Jarrett, A.D.; Goebel, P.; Mallon, B.J.,
Heats of hydrogenation. 9. Cyclic acetylenes and some miscellaneous olefins,
J. Am. Chem. Soc., 1973, 95, 790-792. [all data]
Sicher, Svoboda, et al., 1968
Sicher, J.; Svoboda, M.; Mallon, B.J.; Turner, R.B.,
Stereochemical studies. Part XLVII. Conformational analysis of many-membered ring compounds. The cyclododecenes,
J. Chem. Soc. B, 1968, 441-447. [all data]